{"text_format":"1","workbook":"xlsx","n_sheets":16,"sheets":["Tool","Sheet2","Sheet1","APIE","Augalų aprašymas","Technikos kainos","Paramos sąlygos","Data base","Lists","Niche for catch crops","Data for Pivots","Catch crop features"," Pivot-Features","Data for PAN release","Pivot-Pan release","Questions"],"not_rendered":{"charts":8,"images":21,"macros":1,"external_links":0,"defined_names":6,"comments":0,"pivot_tables":3},"unopened":[],"bounds":{"document_bytes":16777216,"sheet_cells":100000,"rows_first":2000,"rows_last":500,"rows_between":2000,"halvings":0,"cell_chars":16384,"cell_head_chars":4096},"cells_cut":0,"cells_raw":0,"read":"whole","date_system":"1900"}

{"sheet":"Tool","index":0,"n_rows":233,"n_cols":13,"rows_kept":233,"cut":false,"hidden":false,"merged":[[13,2,13,10]]}
[]
["SPRENDIMŲ PRIĖMIMO ĮRANKIS TINKAMIAUSIEMS TARPINIŲ PASĖLIŲ AUGALAMS PASIRINKTI"]
[]
["Šis įrankis sukurtas įgyvendinant projektą \"Optimalūs tarpinių augalų sprendimai siekiant sumažinti tarptautinių Ventos ir Lielupės UBR taršą\" (LLI-49 CATCHPOLLUTION)"]
["Projektą finansavo 2014–2020 m. Interreg V-A Latvijos ir Lietuvos bendradarbiavimo per sieną programa   www.latlit.eu      Projekto biudžetas: 201 845 EUR     ERPF finansavimas: 171 568 EUR"]
[]
["ĮVERTINKITE TARPINIŲ PASĖLIŲ AUGINIMO GALIMYBES"]
["Nurodykite planuojamas pagrindinių pasėlių derliaus nuėmimo ir sėjos datas"]
[]
["Planuojama derliaus nuėmimo data",null,"2020-08-05",null,"įveskite datą"]
[]
["Kito pagrindinio pasėlio sėjos data",null,"2021-04-15",null,"įveskite datą"]
[]
["Niša tarpiniams augalams",null,{"$f":"IF(AND((C12-C10)>=60,C10<DATE((YEAR(C10)),8,20)),\"JŪS TURITE PAKANKAMĄ NIŠĄ POSĖLINIAMS TARPINIAMS PASĖLIAMS\",IF(C12-C10<60,\"NIŠA TARP PAGRINDINIŲ PASĖLIŲ TARPINIAMS POSĖLINIAMS PASĖLIAMS YRA PER TRUMPA\",\"SĖTI TARPINIUS PASĖLIUS PO DERLIAUS NUĖMIMO PER VĖLU; VĖLAI PASĖTI TARPINIAI PASĖLIAI LAUKIAMOS NAUDOS NEDUOS\"))","v":"JŪS TURITE PAKANKAMĄ NIŠĄ POSĖLINIAMS TARPINIAMS PASĖLIAMS"}]
[]
["RASKITE TINKAMIAUSIUS TARPINIŲ PASĖLIŲ AUGALUS"]
["Pateikite informaciją apie savo lauką (dirvožemio tipą, pH), nurodykite sėjomainos rotacijoje auginamus pagrindinius augalus"]
[]
["Dirvožemio tipas",null,"Priemolis",null,"pasirinkite iš sąrašo"]
[]
["Dirvožemio pH",null,"6,6 - 7",null,"pasirinkite iš sąrašo"]
[null,null,true]
["Sėjomainos rotacijoje auginami augalai",null,null,null,null,null,null,null,"pažymėkite sėjomainos rotacijoje auginamus pagrindinius augalus"]
[]
[]
[]
[]
["JUMS REKOMENDUOJAMI AUGALAI:",null,{"$f":"IF(AND(C29=\"\",E29=\"\",G29=\"\",I29=\"\",K29=\"\",M29=\"\"),\"NĖRA JUMS REKOMENDUOJAMŲ AUGALŲ\",\"\")","v":""}]
[null,null,"Baltosios garstyčios",null,"Vasariniai rapsai",null,"Žieminiai rapsai",null,"Aliejiniai ridikai",null,"Žieminiai rapsiukai",null,"Žieminiai rugiai"]
[null,null,{"$f":"IFERROR(VLOOKUP(C29,'Data base'!$A:$B,2,FALSE),\"\")","v":"Sinapis alba L"},null,{"$f":"IFERROR(VLOOKUP(E29,'Data base'!$A:$B,2,FALSE),\"\")","v":"Brassica napus L. ssp. Oleifera"},null,{"$f":"IFERROR(VLOOKUP(G29,'Data base'!$A:$B,2,FALSE),\"\")","v":"Brassica napus L."},null,{"$f":"IFERROR(VLOOKUP(I29,'Data base'!$A:$B,2,FALSE),\"\")","v":"Raphanus sativus L"},null,{"$f":"IFERROR(VLOOKUP(K29,'Data base'!$A:$B,2,FALSE),\"\")","v":"Brassica rapa subsp. rapa"},null,{"$f":"IFERROR(VLOOKUP(M29,'Data base'!$A:$B,2,FALSE),\"\")","v":"Secale cereale L"}]
[]
[]
[]
["SĖJOS IR PRIEŽIŪROS REKOMENDACIJOS"]
[]
["REKOMENDUOJAMAS SĖJOS LAIKOTARPIS"]
["Žemiau pateiktoje lentelėje pasitikrinkite rekomenduojamas sėjos datas"]
[]
[null,null,{"$f":"IF(C29=\"\",\"\",C29)","v":"Baltosios garstyčios"},null,{"$f":"IF(E29=\"\",\"\",E29)","v":"Vasariniai rapsai"},null,{"$f":"IF(G29=\"\",\"\",G29)","v":"Žieminiai rapsai"},null,{"$f":"IF(I29=\"\",\"\",I29)","v":"Aliejiniai ridikai"},null,{"$f":"IF(K29=\"\",\"\",K29)","v":"Žieminiai rapsiukai"},null,{"$f":"IF(M29=\"\",\"\",M29)","v":"Žieminiai rugiai"}]
[{"$f":"IF(C29=\"\",\"\",\"BIRŽELIS / 1-a savaitė\")","v":"BIRŽELIS / 1-a savaitė"},null,{"$f":"IF($C$29=\"\",\"\",VLOOKUP($C$29,'Data base'!$A:$AK,26,FALSE))","v":0},null,{"$f":"IF($E$29=\"\",\"\",VLOOKUP($E$29,'Data base'!$A:$AK,26,FALSE))","v":0},null,{"$f":"IF($G$29=\"\",\"\",VLOOKUP($G$29,'Data base'!$A:$AK,26,FALSE))","v":0},null,{"$f":"IF($I$29=\"\",\"\",VLOOKUP($I$29,'Data base'!$A:$AK,26,FALSE))","v":0},null,{"$f":"IF($K$29=\"\",\"\",VLOOKUP($K$29,'Data base'!$A:$AK,26,FALSE))","v":0},null,{"$f":"IF($M$29=\"\",\"\",VLOOKUP($M$29,'Data base'!$A:$AK,26,FALSE))","v":0}]
[{"$f":"IF(C29=\"\",\"\",\"BIRŽELIS /2-a savaitė\")","v":"BIRŽELIS /2-a savaitė"},null,{"$f":"IF($C$29=\"\",\"\",VLOOKUP($C$29,'Data base'!$A:$AK,27,FALSE))","v":0},null,{"$f":"IF($E$29=\"\",\"\",VLOOKUP($E$29,'Data base'!$A:$AK,27,FALSE))","v":0},null,{"$f":"IF($G$29=\"\",\"\",VLOOKUP($G$29,'Data base'!$A:$AK,27,FALSE))","v":"٧"},null,{"$f":"IF($I$29=\"\",\"\",VLOOKUP($I$29,'Data base'!$A:$AK,27,FALSE))","v":0},null,{"$f":"IF($K$29=\"\",\"\",VLOOKUP($K$29,'Data base'!$A:$AK,27,FALSE))","v":0},null,{"$f":"IF($M$29=\"\",\"\",VLOOKUP($M$29,'Data base'!$A:$AK,27,FALSE))","v":0}]
[{"$f":"IF(C29=\"\",\"\",\"BIRŽELIS/ 3-ia savaitė\")","v":"BIRŽELIS/ 3-ia savaitė"},null,{"$f":"IF($C$29=\"\",\"\",VLOOKUP($C$29,'Data base'!$A:$AK,28,FALSE))","v":0},null,{"$f":"IF($E$29=\"\",\"\",VLOOKUP($E$29,'Data base'!$A:$AK,28,FALSE))","v":0},null,{"$f":"IF($G$29=\"\",\"\",VLOOKUP($G$29,'Data base'!$A:$AK,28,FALSE))","v":"٧"},null,{"$f":"IF($I$29=\"\",\"\",VLOOKUP($I$29,'Data base'!$A:$AK,28,FALSE))","v":0},null,{"$f":"IF($K$29=\"\",\"\",VLOOKUP($K$29,'Data base'!$A:$AK,28,FALSE))","v":"٧"},null,{"$f":"IF($M$29=\"\",\"\",VLOOKUP($M$29,'Data base'!$A:$AK,28,FALSE))","v":0}]
[{"$f":"IF(C29=\"\",\"\",\"BIRŽELIS / 4-a savaitė\")","v":"BIRŽELIS / 4-a savaitė"},null,{"$f":"IF($C$29=\"\",\"\",VLOOKUP($C$29,'Data base'!$A:$AK,29,FALSE))","v":0},null,{"$f":"IF($E$29=\"\",\"\",VLOOKUP($E$29,'Data base'!$A:$AK,29,FALSE))","v":"٧"},null,{"$f":"IF($G$29=\"\",\"\",VLOOKUP($G$29,'Data base'!$A:$AK,29,FALSE))","v":"٧"},null,{"$f":"IF($I$29=\"\",\"\",VLOOKUP($I$29,'Data base'!$A:$AK,29,FALSE))","v":"٧"},null,{"$f":"IF($K$29=\"\",\"\",VLOOKUP($K$29,'Data base'!$A:$AK,29,FALSE))","v":"٧"},null,{"$f":"IF($M$29=\"\",\"\",VLOOKUP($M$29,'Data base'!$A:$AK,29,FALSE))","v":"٧"}]
[{"$f":"IF(C29=\"\",\"\",\"LIEPA / 1-a savaitė\")","v":"LIEPA / 1-a savaitė"},null,{"$f":"IF($C$29=\"\",\"\",VLOOKUP($C$29,'Data base'!$A:$AK,30,FALSE))","v":"٧"},null,{"$f":"IF($E$29=\"\",\"\",VLOOKUP($E$29,'Data base'!$A:$AK,30,FALSE))","v":"٧"},null,{"$f":"IF($G$29=\"\",\"\",VLOOKUP($G$29,'Data base'!$A:$AK,30,FALSE))","v":"٧"},null,{"$f":"IF($I$29=\"\",\"\",VLOOKUP($I$29,'Data base'!$A:$AK,30,FALSE))","v":"٧"},null,{"$f":"IF($K$29=\"\",\"\",VLOOKUP($K$29,'Data base'!$A:$AK,30,FALSE))","v":"٧"},null,{"$f":"IF($M$29=\"\",\"\",VLOOKUP($M$29,'Data base'!$A:$AK,30,FALSE))","v":"٧"}]
[{"$f":"IF(C29=\"\",\"\",\"LIEPA / 2-a savaitė\")","v":"LIEPA / 2-a savaitė"},null,{"$f":"IF($C$29=\"\",\"\",VLOOKUP($C$29,'Data base'!$A:$AK,31,FALSE))","v":"٧"},null,{"$f":"IF($E$29=\"\",\"\",VLOOKUP($E$29,'Data base'!$A:$AK,31,FALSE))","v":"٧"},null,{"$f":"IF($G$29=\"\",\"\",VLOOKUP($G$29,'Data base'!$A:$AK,31,FALSE))","v":"٧"},null,{"$f":"IF($I$29=\"\",\"\",VLOOKUP($I$29,'Data base'!$A:$AK,31,FALSE))","v":"٧"},null,{"$f":"IF($K$29=\"\",\"\",VLOOKUP($K$29,'Data base'!$A:$AK,31,FALSE))","v":"٧"},null,{"$f":"IF($M$29=\"\",\"\",VLOOKUP($M$29,'Data base'!$A:$AK,31,FALSE))","v":"٧"}]
[{"$f":"IF(C29=\"\",\"\",\"LIEPA / 3-ia savaitė\")","v":"LIEPA / 3-ia savaitė"},null,{"$f":"IF($C$29=\"\",\"\",VLOOKUP($C$29,'Data base'!$A:$AK,32,FALSE))","v":"٧"},null,{"$f":"IF($E$29=\"\",\"\",VLOOKUP($E$29,'Data base'!$A:$AK,32,FALSE))","v":"٧"},null,{"$f":"IF($G$29=\"\",\"\",VLOOKUP($G$29,'Data base'!$A:$AK,32,FALSE))","v":"٧"},null,{"$f":"IF($I$29=\"\",\"\",VLOOKUP($I$29,'Data base'!$A:$AK,32,FALSE))","v":"٧"},null,{"$f":"IF($K$29=\"\",\"\",VLOOKUP($K$29,'Data base'!$A:$AK,32,FALSE))","v":"٧"},null,{"$f":"IF($M$29=\"\",\"\",VLOOKUP($M$29,'Data base'!$A:$AK,32,FALSE))","v":"٧"}]
[{"$f":"IF(C29=\"\",\"\",\"LIEPA / 4-a savaitė\")","v":"LIEPA / 4-a savaitė"},null,{"$f":"IF($C$29=\"\",\"\",VLOOKUP($C$29,'Data base'!$A:$AK,33,FALSE))","v":"٧"},null,{"$f":"IF($E$29=\"\",\"\",VLOOKUP($E$29,'Data base'!$A:$AK,33,FALSE))","v":"٧"},null,{"$f":"IF($G$29=\"\",\"\",VLOOKUP($G$29,'Data base'!$A:$AK,33,FALSE))","v":"٧"},null,{"$f":"IF($I$29=\"\",\"\",VLOOKUP($I$29,'Data base'!$A:$AK,33,FALSE))","v":"٧"},null,{"$f":"IF($K$29=\"\",\"\",VLOOKUP($K$29,'Data base'!$A:$AK,33,FALSE))","v":"٧"},null,{"$f":"IF($M$29=\"\",\"\",VLOOKUP($M$29,'Data base'!$A:$AK,33,FALSE))","v":"٧"}]
[{"$f":"IF(C29=\"\",\"\",\"RUGPJŪTIS / 1-a savaitė\")","v":"RUGPJŪTIS / 1-a savaitė"},null,{"$f":"IF($C$29=\"\",\"\",VLOOKUP($C$29,'Data base'!$A:$AK,34,FALSE))","v":"٧"},null,{"$f":"IF($E$29=\"\",\"\",VLOOKUP($E$29,'Data base'!$A:$AK,34,FALSE))","v":"٧"},null,{"$f":"IF($G$29=\"\",\"\",VLOOKUP($G$29,'Data base'!$A:$AK,34,FALSE))","v":"٧"},null,{"$f":"IF($I$29=\"\",\"\",VLOOKUP($I$29,'Data base'!$A:$AK,34,FALSE))","v":"٧"},null,{"$f":"IF($K$29=\"\",\"\",VLOOKUP($K$29,'Data base'!$A:$AK,34,FALSE))","v":"٧"},null,{"$f":"IF($M$29=\"\",\"\",VLOOKUP($M$29,'Data base'!$A:$AK,34,FALSE))","v":"٧"}]
[{"$f":"IF(C29=\"\",\"\",\"RUGPJŪTIS / 2-a savaitė\")","v":"RUGPJŪTIS / 2-a savaitė"},null,{"$f":"IF($C$29=\"\",\"\",VLOOKUP($C$29,'Data base'!$A:$AK,35,FALSE))","v":"٧"},null,{"$f":"IF($E$29=\"\",\"\",VLOOKUP($E$29,'Data base'!$A:$AK,35,FALSE))","v":"٧"},null,{"$f":"IF($G$29=\"\",\"\",VLOOKUP($G$29,'Data base'!$A:$AK,35,FALSE))","v":"٧"},null,{"$f":"IF($I$29=\"\",\"\",VLOOKUP($I$29,'Data base'!$A:$AK,35,FALSE))","v":"٧"},null,{"$f":"IF($K$29=\"\",\"\",VLOOKUP($K$29,'Data base'!$A:$AK,35,FALSE))","v":"٧"},null,{"$f":"IF($M$29=\"\",\"\",VLOOKUP($M$29,'Data base'!$A:$AK,35,FALSE))","v":"٧"}]
[{"$f":"IF(C29=\"\",\"\",\"RUGPJŪTIS / 3-ia savaitė\")","v":"RUGPJŪTIS / 3-ia savaitė"},null,{"$f":"IF($C$29=\"\",\"\",VLOOKUP($C$29,'Data base'!$A:$AK,36,FALSE))","v":"٧"},null,{"$f":"IF($E$29=\"\",\"\",VLOOKUP($E$29,'Data base'!$A:$AK,36,FALSE))","v":0},null,{"$f":"IF($G$29=\"\",\"\",VLOOKUP($G$29,'Data base'!$A:$AK,36,FALSE))","v":0},null,{"$f":"IF($I$29=\"\",\"\",VLOOKUP($I$29,'Data base'!$A:$AK,36,FALSE))","v":0},null,{"$f":"IF($K$29=\"\",\"\",VLOOKUP($K$29,'Data base'!$A:$AK,36,FALSE))","v":0},null,{"$f":"IF($M$29=\"\",\"\",VLOOKUP($M$29,'Data base'!$A:$AK,36,FALSE))","v":"٧"}]
[{"$f":"IF(C29=\"\",\"\",\"RUGPJŪTIS / 4-a savaitė\")","v":"RUGPJŪTIS / 4-a savaitė"},null,{"$f":"IF($C$29=\"\",\"\",VLOOKUP($C$29,'Data base'!$A:$AK,37,FALSE))","v":0},null,{"$f":"IF($E$29=\"\",\"\",VLOOKUP($E$29,'Data base'!$A:$AK,37,FALSE))","v":0},null,{"$f":"IF($G$29=\"\",\"\",VLOOKUP($G$29,'Data base'!$A:$AK,37,FALSE))","v":0},null,{"$f":"IF($I$29=\"\",\"\",VLOOKUP($I$29,'Data base'!$A:$AK,37,FALSE))","v":0},null,{"$f":"IF($K$29=\"\",\"\",VLOOKUP($K$29,'Data base'!$A:$AK,37,FALSE))","v":0},null,{"$f":"IF($M$29=\"\",\"\",VLOOKUP($M$29,'Data base'!$A:$AK,37,FALSE))","v":0}]
[]
["SĖJOS NORMOS IR REKOMENDACIJOS"]
["Žemiau pateiktoje lentelėje sužinokite rekomenduojamas sėjos normas"]
[]
[null,null,{"$f":"IF(C29=\"\",\"\",C29)","v":"Baltosios garstyčios"},null,{"$f":"IF(E29=\"\",\"\",E29)","v":"Vasariniai rapsai"},null,{"$f":"IF(G29=\"\",\"\",G29)","v":"Žieminiai rapsai"},null,{"$f":"IF(I29=\"\",\"\",I29)","v":"Aliejiniai ridikai"},null,{"$f":"IF(K29=\"\",\"\",K29)","v":"Žieminiai rapsiukai"},null,{"$f":"IF(M29=\"\",\"\",M29)","v":"Žieminiai rugiai"}]
[]
["NORMA SĖKLAS IŠBARSTANT, kg/ha",null,{"$f":"IF(C29=\"\",\"\",VLOOKUP(C29,'Data base'!$A:$AN,40,FALSE))","v":30},null,{"$f":"IF(E29=\"\",\"\",VLOOKUP(E29,'Data base'!$A:$AN,40,FALSE))","v":20},null,{"$f":"IF(G29=\"\",\"\",VLOOKUP(G29,'Data base'!$A:$AN,40,FALSE))","v":20},null,{"$f":"IF(I29=\"\",\"\",VLOOKUP(I29,'Data base'!$A:$AN,40,FALSE))","v":"Nerekomenduojama"},null,{"$f":"IF(K29=\"\",\"\",VLOOKUP(K29,'Data base'!$A:$AN,40,FALSE))","v":"Nerekomenduojama"},null,{"$f":"IF(M29=\"\",\"\",VLOOKUP(M29,'Data base'!$A:$AN,40,FALSE))","v":"Nerekomenduojama"}]
[]
["NORMA SĖKLAS ĮTERPIANT, kg/ha",null,{"$f":"IF(C29=\"\",\"\",VLOOKUP(C29,'Data base'!$A:$AN,39,FALSE))","v":"10-15"},null,{"$f":"IF(E29=\"\",\"\",VLOOKUP(E29,'Data base'!$A:$AN,39,FALSE))","v":"10-20"},null,{"$f":"IF(G29=\"\",\"\",VLOOKUP(G29,'Data base'!$A:$AN,39,FALSE))","v":"8-20"},null,{"$f":"IF(I29=\"\",\"\",VLOOKUP(I29,'Data base'!$A:$AN,39,FALSE))","v":"10-25"},null,{"$f":"IF(K29=\"\",\"\",VLOOKUP(K29,'Data base'!$A:$AN,39,FALSE))","v":"5-10"},null,{"$f":"IF(M29=\"\",\"\",VLOOKUP(M29,'Data base'!$A:$AN,39,FALSE))","v":"70-90"}]
[]
["SĖJOS PATARIMAI IR REKOMENDACIJOS",null,{"$f":"IF($C$29=\"\",\"\",VLOOKUP($C$29,'Data base'!$A:$AW,49,FALSE))","v":"Gali būti sėjamos sėklą išberiant ant paruoštos  dirvos paviršiaus, arba naudojant įprastą sėjamąją. Guoliavietės pagrindas turi būti  kietas, joje neturėtų būti piktžolių pradų. Privoluokite dirvą, kad pagerintumėte sėklų ir dirvožemio kontaktą, bet nesuardykite dirvožemio agregatų. Sėjos gylis 1-2 cm. Gali būti auginamos mišiniuose su ankštiniais (pvz. dobilais, vikiais) arba žolėmis."},null,{"$f":"IF($E$29=\"\",\"\",VLOOKUP($E$29,'Data base'!$A:$AW,49,FALSE))","v":"Sėkla gali būti sėjama sėjamosiomis  arba išberiama skutant ar kultivuojant dirvą po pagrindinių augalų nuėmimo. Paruoškite lygią, be piktžolių pradų sėklos guoliavietę, kurioje dygimui netrūktų drėgmės. Po sėjos privoluokite dirvą, kad pagerintumėte sėklų ir dirvožemio sąlytį. Gali būti auginami mišiniuose su ankštiniais (pvz. vikiais, žirniais, pupomis) arba žolėmis (pvz. svidrėmis)."},null,{"$f":"IF($G$29=\"\",\"\",VLOOKUP($G$29,'Data base'!$A:$AW,49,FALSE))","v":"Paruoškite lygią, be piktžolių pradų sėklos guoliavietę, kurioje dygimui netrūktų drėgmės. Po sėjos privoluokite dirvą, kad pagerintumėte sėklų ir dirvožemio sąlytį, bet nesuardykite dirvožemio agregatų. Gali būti auginami mišiniuose su ankštiniais (pvz. vikiais, žirniais, pupomis) arba žolėmis (pvz. svidrėmis)."},null,{"$f":"IF($I$29=\"\",\"\",VLOOKUP($I$29,'Data base'!$A:$AW,49,FALSE))","v":"Sėti kiek galima anksčiau. Sėjant sėjamosiomis pasėlis daug geresnis, todėl berti ant paviršiaus tikslinga tik kai dirvožemis per daug šlapias sėti sėjamąja. Po sėjos privoluokite dirvą, kad pagerintumėte sėklų ir dirvožemio sąlytį, bet nesutraiškykite dirvožemio agregatų. Gali būti auginami mišiniuose su ankštiniais."},null,{"$f":"IF($K$29=\"\",\"\",VLOOKUP($K$29,'Data base'!$A:$AW,49,FALSE))","v":"Paruoškite lygią, be piktžolių pradų sėklos guoliavietę, kurioje dygimui netrūktų drėgmės. Po sėjos privoluokite dirvą, kad pagerintumėte sėklų ir dirvožemio sąlytį, bet nesutraiškykite dirvožemio agregatų. Galite auginti kaip pavienį tarpinį pasėlį arba mišiniuose su ankštiniais (pvz., vikiais, žirniais)."},null,{"$f":"IF($M$29=\"\",\"\",VLOOKUP($M$29,'Data base'!$A:$AW,49,FALSE))","v":"Paruoškite sėklos guoliavietę be grumstų ir piktžolių. Jei žemės dirbimas neįmanomas, rugiai gali būti išberiami ant drėgnos, neįdirbtos dirvos. Gali būti auginami mišiniuose su ankštiniais (pvz., žirniais, vikiais, pupomis)."}]
[]
["GALIMOS PROBLEMOS",null,{"$f":"IF($C$29=\"\",\"\",VLOOKUP($C$29,'Data base'!$A:$AW,48,FALSE))","v":"Neleiskite subrandinti sėklų. Neauginkite sėjomainose su bastutinių šeimos augalais. Labiau tinka lengvi, vandeniui laidūs dirvožemiai. Drėgnuose dirvožemiuose auga prastai. Sausose ir šiltose vietose vystymąsis gali būti greitas, dėl to kyla sumedėjimo rizika. Jautrios kenkėjams, tokiems kaip pjūklelių lervos, aruodiniai straubliukai, spragės."},null,{"$f":"IF($E$29=\"\",\"\",VLOOKUP($E$29,'Data base'!$A:$AW,48,FALSE))","v":"Linkę užsikrėsti įvairiomis ligomis. Kad jų išvengtumėte, neauginkite sėjomainose su bastutinių šeimos augalais. Būtina gerai paruošta dirva. Dirvos suslėgimas riboja šaknijimąsi, tai gali sumažinti maisto medžiagių ir vandens įsisavinimą."},null,{"$f":"IF($G$29=\"\",\"\",VLOOKUP($G$29,'Data base'!$A:$AW,48,FALSE))","v":"Gali platinti bastutinių šeimos augalų ligas, todėl nenaudokite sėjomainose su bastutinių šeimos augalais. Dygti gali lėtai. Jautresni dirvos suspaudimui nei javai."},null,{"$f":"IF($I$29=\"\",\"\",VLOOKUP($I$29,'Data base'!$A:$AW,48,FALSE))","v":"Nenaudokite sėjomainoje su bastutinių šeimos daržovėmis. Ridikai pritraukia sprages, tačiau rudens laikotarpiu kiek mažiau. Ridikai prastai toleruoja drėgnas dirvas. Jautriai reaguoja į azoto kiekį dirvožemyje. Esant azoto deficitui prastai konkuruoja su piktžolėmis."},null,{"$f":"IF($K$29=\"\",\"\",VLOOKUP($K$29,'Data base'!$A:$AW,48,FALSE))","v":"Gali platinti bastutinių šeimos augalų ligas. Nenaudokite sėjomainose su bastutinių šeimos augalais. Dygti gali lėtai.  Dirvožemio drėgmės išsaugojimas užtikrina gerą rapsiukų sudygimą."},null,{"$f":"IF($M$29=\"\",\"\",VLOOKUP($M$29,'Data base'!$A:$AW,48,FALSE))","v":"Yrant rugių biomasei gali būti imobilizuojamas dirvožemio azotas. Azoto imobilizavimą apsprendžia rugių subrendimo laipsnis. Rugių biomasėje sukaupto azoto mineralizacija yra labai lėta, tad neverta tikėtis, kad peržiemojusių rugių sukauptas azotas greitai bus prieinamas kitiems augalams. Augalus, kuriems yra reikalingas azotas, reikėtų sėti ne anksčiau kaip 2 savaitės po rugių įterpimo."}]
[]
["GALIMI AUGINIMO SUNKUMAI"]
["Susipažinkite su kokiais tarpinių pasėlių auginimo iššūkiais galite susidurti"]
[]
[null,null,{"$f":"IF(C29=\"\",\"\",C29)","v":"Baltosios garstyčios"},null,{"$f":"IF(E29=\"\",\"\",E29)","v":"Vasariniai rapsai"},null,{"$f":"IF(G29=\"\",\"\",G29)","v":"Žieminiai rapsai"},null,{"$f":"IF(I29=\"\",\"\",I29)","v":"Aliejiniai ridikai"},null,{"$f":"IF(K29=\"\",\"\",K29)","v":"Žieminiai rapsiukai"},null,{"$f":"IF(M29=\"\",\"\",M29)","v":"Žieminiai rugiai"}]
[]
["Sudygimas, susiformavimas",null,{"$f":"IF($C$29=\"\",\"\",VLOOKUP($C$29,'Data base'!$A:$AU,43,FALSE))","v":0},null,{"$f":"IF($E$29=\"\",\"\",VLOOKUP($E$29,'Data base'!$A:$AU,43,FALSE))","v":0},null,{"$f":"IF($G$29=\"\",\"\",VLOOKUP($G$29,'Data base'!$A:$AU,43,FALSE))","v":0},null,{"$f":"IF($I$29=\"\",\"\",VLOOKUP($I$29,'Data base'!$A:$AU,43,FALSE))","v":0},null,{"$f":"IF($K$29=\"\",\"\",VLOOKUP($K$29,'Data base'!$A:$AU,43,FALSE))","v":0},null,{"$f":"IF($M$29=\"\",\"\",VLOOKUP($M$29,'Data base'!$A:$AU,43,FALSE))","v":1}]
[]
["Trukdymas kultūrinimas augalams",null,{"$f":"IF($C$29=\"\",\"\",VLOOKUP($C$29,'Data base'!$A:$AU,44,FALSE))","v":2},null,{"$f":"IF($E$29=\"\",\"\",VLOOKUP($E$29,'Data base'!$A:$AU,44,FALSE))","v":2},null,{"$f":"IF($G$29=\"\",\"\",VLOOKUP($G$29,'Data base'!$A:$AU,44,FALSE))","v":2},null,{"$f":"IF($I$29=\"\",\"\",VLOOKUP($I$29,'Data base'!$A:$AU,44,FALSE))","v":0},null,{"$f":"IF($K$29=\"\",\"\",VLOOKUP($K$29,'Data base'!$A:$AU,44,FALSE))","v":2},null,{"$f":"IF($M$29=\"\",\"\",VLOOKUP($M$29,'Data base'!$A:$AU,44,FALSE))","v":3}]
[]
["Panaikinimas žemės dirbimu",null,{"$f":"IF($C$29=\"\",\"\",VLOOKUP($C$29,'Data base'!$A:$AU,45,FALSE))","v":0},null,{"$f":"IF($E$29=\"\",\"\",VLOOKUP($E$29,'Data base'!$A:$AU,45,FALSE))","v":2},null,{"$f":"IF($G$29=\"\",\"\",VLOOKUP($G$29,'Data base'!$A:$AU,45,FALSE))","v":2},null,{"$f":"IF($I$29=\"\",\"\",VLOOKUP($I$29,'Data base'!$A:$AU,45,FALSE))","v":0},null,{"$f":"IF($K$29=\"\",\"\",VLOOKUP($K$29,'Data base'!$A:$AU,45,FALSE))","v":2},null,{"$f":"IF($M$29=\"\",\"\",VLOOKUP($M$29,'Data base'!$A:$AU,45,FALSE))","v":1}]
[]
["Panaikinimas nupjaunant",null,{"$f":"IF($C$29=\"\",\"\",VLOOKUP($C$29,'Data base'!$A:$AU,46,FALSE))","v":3},null,{"$f":"IF($E$29=\"\",\"\",VLOOKUP($E$29,'Data base'!$A:$AU,46,FALSE))","v":3},null,{"$f":"IF($G$29=\"\",\"\",VLOOKUP($G$29,'Data base'!$A:$AU,46,FALSE))","v":3},null,{"$f":"IF($I$29=\"\",\"\",VLOOKUP($I$29,'Data base'!$A:$AU,46,FALSE))","v":1},null,{"$f":"IF($K$29=\"\",\"\",VLOOKUP($K$29,'Data base'!$A:$AU,46,FALSE))","v":3},null,{"$f":"IF($M$29=\"\",\"\",VLOOKUP($M$29,'Data base'!$A:$AU,46,FALSE))","v":0}]
[]
["Subrendusio pasėlio įterpimas",null,{"$f":"IF($C$29=\"\",\"\",VLOOKUP($C$29,'Data base'!$A:$AU,47,FALSE))","v":0},null,{"$f":"IF($E$29=\"\",\"\",VLOOKUP($E$29,'Data base'!$A:$AU,47,FALSE))","v":1},null,{"$f":"IF($G$29=\"\",\"\",VLOOKUP($G$29,'Data base'!$A:$AU,47,FALSE))","v":1},null,{"$f":"IF($I$29=\"\",\"\",VLOOKUP($I$29,'Data base'!$A:$AU,47,FALSE))","v":0},null,{"$f":"IF($K$29=\"\",\"\",VLOOKUP($K$29,'Data base'!$A:$AU,47,FALSE))","v":1},null,{"$f":"IF($M$29=\"\",\"\",VLOOKUP($M$29,'Data base'!$A:$AU,47,FALSE))","v":4}]
[]
[null,null,"Įvertis:         Problema          Gali būti problema         Gali būti nedidelė problema         Retkarčiais būna nedidelė problema          Problemų nekelia"]
[]
["REKOMENDUOJAMŲ TARPINIŲ PASĖLIŲ AUGALŲ SAVYBĖS"]
[]
["Langelyje kairėje pasirinkite vieną iš jums rekomenduojamų augalų ir sužinokite jo atsparumą/ toleranciją aplinkos veiksniams, privalumus ir trūkumus, veiksmingumą ir funkcijas"]
[]
[]
[]
[]
[null,null,null,null,"PivotTableUpdate"]
[null,null,null,null,null,null,null,null,null,null,{"$f":"IF(' Pivot-Features'!$A$5=\"Trūkumai: žaladarių pavojus\", \"0 - Problema\",\"0 - Prastas\")","v":"0 - Prastas"}]
[null,null,null,null,null,null,null,null,null,null,{"$f":"IF(' Pivot-Features'!$A$5=\"Trūkumai: žaladarių pavojus\", \"1 - Gali būti problema\",\"1 - Pusėtinas\")","v":"1 - Pusėtinas"}]
[null,null,null,null,null,null,null,null,null,null,{"$f":"IF(' Pivot-Features'!$A$5=\"Trūkumai: žaladarių pavojus\", \"2 - Gali būti nedidelė problema\",\"2 - Geras\")","v":"2 - Geras"}]
[null,null,null,null,null,null,null,null,null,null,{"$f":"IF(' Pivot-Features'!$A$5=\"Trūkumai: žaladarių pavojus\", \"3 - Kartais būna nedidelė problema\",\"3 - Labai geras\")","v":"3 - Labai geras"}]
[null,null,null,null,null,null,null,null,null,null,{"$f":"IF(' Pivot-Features'!$A$5=\"Trūkumai: žaladarių pavojus\", \"4 - Problemų nekelia\",\"4 - Puikus\")","v":"4 - Puikus"}]
[]
[]
[]
[]
[]
[]
[]
[]
[]
[]
[]
[]
["TIKĖTINAS REKOMENDUOJAMŲ AUGALŲ POVEIKIS"]
[]
["UŽAUGINAMA BIOMASĖ"]
["Sužinokite įprastai užauginamą sausos biomasės kiekį ir, jei reikia, pakoreguokite jį atsižvelgdami į prognozuojamą produktyvumą savo ūkyje"]
[]
[null,null,{"$f":"IF(C29=\"\",\"\",C29)","v":"Baltosios garstyčios"},null,{"$f":"IF(E29=\"\",\"\",E29)","v":"Vasariniai rapsai"},null,{"$f":"IF(G29=\"\",\"\",G29)","v":"Žieminiai rapsai"},null,{"$f":"IF(I29=\"\",\"\",I29)","v":"Aliejiniai ridikai"},null,{"$f":"IF(K29=\"\",\"\",K29)","v":"Žieminiai rapsiukai"},null,{"$f":"IF(M29=\"\",\"\",M29)","v":"Žieminiai rugiai"}]
[]
["TIKĖTINAS SAUSOS BIOMASĖS KIEKIS, T/HA",null,2.3000000000000003,null,1.55,null,1.55,null,2.95,null,1.65,null,1.25]
[]
["AZOTO KREDITAS (t.y. KITAM AUGALUI PERDUODAMAS AZOTO KIEKIS)"]
["Žemiau pateiktoje lentelėje sužinokite, kiek mineralinio azoto ateinančio sezono metu tarpinių pasėlių augalai perduos kitam pagrindiniam pasėliui"]
[]
[null,null,{"$f":"IF(C29=\"\",\"\",C29)","v":"Baltosios garstyčios"},null,{"$f":"IF(E29=\"\",\"\",E29)","v":"Vasariniai rapsai"},null,{"$f":"IF(G29=\"\",\"\",G29)","v":"Žieminiai rapsai"},null,{"$f":"IF(I29=\"\",\"\",I29)","v":"Aliejiniai ridikai"},null,{"$f":"IF(K29=\"\",\"\",K29)","v":"Žieminiai rapsiukai"},null,{"$f":"IF(M29=\"\",\"\",M29)","v":"Žieminiai rugiai"}]
[]
["AZOTO KREDITAS, KG/HA",null,{"$f":"IF(C29=\"\",\"\",VLOOKUP(C29,'Data base'!$A:$BV,74,FALSE)/VLOOKUP(C29,'Data base'!$A:$AP,41,FALSE)*Tool!C115)","v":36.459766011367734},null,{"$f":"IF(E29=\"\",\"\",VLOOKUP(E29,'Data base'!$A:$BV,74,FALSE)/VLOOKUP(E29,'Data base'!$A:$AP,41,FALSE)*Tool!E115)","v":21.802397665420209},null,{"$f":"IF(G29=\"\",\"\",VLOOKUP(G29,'Data base'!$A:$BV,74,FALSE)/VLOOKUP(G29,'Data base'!$A:$AP,41,FALSE)*Tool!G115)","v":21.802397665420209},null,{"$f":"IF(I29=\"\",\"\",VLOOKUP(I29,'Data base'!$A:$BV,74,FALSE)/VLOOKUP(I29,'Data base'!$A:$AP,41,FALSE)*Tool!I115)","v":44.125255808964546},null,{"$f":"IF(K29=\"\",\"\",VLOOKUP(K29,'Data base'!$A:$BV,74,FALSE)/VLOOKUP(K29,'Data base'!$A:$AP,41,FALSE)*Tool!K115)","v":20.280662074208038},null,{"$f":"IF(M29=\"\",\"\",VLOOKUP(M29,'Data base'!$A:$BV,74,FALSE)/VLOOKUP(M29,'Data base'!$A:$AP,41,FALSE)*Tool!M115)","v":11.082730279069693}]
[]
["Iš žemiau pateikto paveiksliuko sužinokite mineralinio azoto susidarymo dinamiką"]
[]
[]
[null,null,null,null,null,null,null,null,"Pastabos:"]
[null,null,null,null,null,null,null,null,"Neigiami skaičiai rodo laikiną azoto imobilizaciją dirvožemyje"]
[null,null,null,null,null,null,null,null,"Teigiami skaičiai rodo mineralinio azoto susidarymą "]
[null,null,null,null,null,null,null,null,"Dienos atspindi laikotarpį nuo mineralizacijos proceso pradžios"]
[null,null,null,null,null,null,null,null,"(mineralizacija prasideda kuomet temperatūra pakyla aukščiau 50C)"]
[]
[null,null,null,null,null,null,null,null,"Tręšimo normą galite sumažinti tokiu azoto kiekiu, kiek jo susidaro iš tarpinių pasėlių augalų !"]
[]
[]
[]
[]
[]
[]
["PIKTŽOLĖTUMO MAŽINIMAS"]
["Sužinokite tarpinių pasėlių augalų potencialą mažinti pasėlių piktžolėtumą"]
[]
[null,null,{"$f":"IF(C29=\"\",\"\",C29)","v":"Baltosios garstyčios"},null,{"$f":"IF(E29=\"\",\"\",E29)","v":"Vasariniai rapsai"},null,{"$f":"IF(G29=\"\",\"\",G29)","v":"Žieminiai rapsai"},null,{"$f":"IF(I29=\"\",\"\",I29)","v":"Aliejiniai ridikai"},null,{"$f":"IF(K29=\"\",\"\",K29)","v":"Žieminiai rapsiukai"},null,{"$f":"IF(M29=\"\",\"\",M29)","v":"Žieminiai rugiai"}]
[]
["PIKTŽOLĖTUMO MAŽINIMAS, %",null,{"$f":"IF(C29=\"\",\"\",VLOOKUP(C143,'Data base'!$A:$BZ,75,FALSE))","v":90},null,{"$f":"IF(E29=\"\",\"\",VLOOKUP(E143,'Data base'!$A:$BZ,75,FALSE))","v":80},null,{"$f":"IF(G29=\"\",\"\",VLOOKUP(G143,'Data base'!$A:$BZ,75,FALSE))","v":80},null,{"$f":"IF(I29=\"\",\"\",VLOOKUP(I143,'Data base'!$A:$BZ,75,FALSE))","v":90},null,{"$f":"IF(K29=\"\",\"\",VLOOKUP(K143,'Data base'!$A:$BZ,75,FALSE))","v":80},null,{"$f":"IF(M29=\"\",\"\",VLOOKUP(M143,'Data base'!$A:$BZ,75,FALSE))","v":75}]
[]
["DIRVOŽEMIO ORGANINĖS ANGLIES (DOA) SUSIDARYMAS"]
["Sužinokite dirvožemio organinės anglies kiekį, kuris gali susidaryti iš tarpinių pasėlių augalų liekanų"]
[]
[null,null,{"$f":"IF(C29=\"\",\"\",C29)","v":"Baltosios garstyčios"},null,{"$f":"IF(E29=\"\",\"\",E29)","v":"Vasariniai rapsai"},null,{"$f":"IF(G29=\"\",\"\",G29)","v":"Žieminiai rapsai"},null,{"$f":"IF(I29=\"\",\"\",I29)","v":"Aliejiniai ridikai"},null,{"$f":"IF(K29=\"\",\"\",K29)","v":"Žieminiai rapsiukai"},null,{"$f":"IF(M29=\"\",\"\",M29)","v":"Žieminiai rugiai"}]
[]
["TIKĖTINAS DOA SUSIDARYMAS, kg/ha",null,{"$f":"IF(C29=\"\",\"\",VLOOKUP(C150,'Data base'!$A:$CB,80,FALSE)/VLOOKUP(C150,'Data base'!$A:$AO,41,FALSE)*Tool!C115)","v":200},null,{"$f":"IF(E29=\"\",\"\",VLOOKUP(E150,'Data base'!$A:$CB,80,FALSE)/VLOOKUP(E150,'Data base'!$A:$AO,41,FALSE)*Tool!E115)","v":150},null,{"$f":"IF(G29=\"\",\"\",VLOOKUP(G150,'Data base'!$A:$CB,80,FALSE)/VLOOKUP(G150,'Data base'!$A:$AO,41,FALSE)*Tool!G115)","v":150},null,{"$f":"IF(I29=\"\",\"\",VLOOKUP(I150,'Data base'!$A:$CB,80,FALSE)/VLOOKUP(I150,'Data base'!$A:$AO,41,FALSE)*Tool!I115)","v":250},null,{"$f":"IF(K29=\"\",\"\",VLOOKUP(K150,'Data base'!$A:$CB,80,FALSE)/VLOOKUP(K150,'Data base'!$A:$AO,41,FALSE)*Tool!K115)","v":150},null,{"$f":"IF(M29=\"\",\"\",VLOOKUP(M150,'Data base'!$A:$CB,80,FALSE)/VLOOKUP(M150,'Data base'!$A:$AO,41,FALSE)*Tool!M115)","v":160}]
[]
["SĖJOS IR PANAIKINIMO SĄNAUDOS"]
[]
["Žemiau pateiktoje lentelėje pasitikrinkite sėklos kainą ir sėjos normą. Jei pateikti duomenys jums netinka, nurodykite savo sėklos kainą ir sėklos normą."]
[]
[null,null,{"$f":"IF(C29=\"\",\"\",C29)","v":"Baltosios garstyčios"},null,{"$f":"IF(E29=\"\",\"\",E29)","v":"Vasariniai rapsai"},null,{"$f":"IF(G29=\"\",\"\",G29)","v":"Žieminiai rapsai"},null,{"$f":"IF(I29=\"\",\"\",I29)","v":"Aliejiniai ridikai"},null,{"$f":"IF(K29=\"\",\"\",K29)","v":"Žieminiai rapsiukai"},null,{"$f":"IF(M29=\"\",\"\",M29)","v":"Žieminiai rugiai"}]
[]
["SĖKLOS KAINA, €/kg",null,1.78,null,1.5,null,1.5,null,1.69,null,1.5,null,0.5]
[]
["SĖJOS NORMA, kg/ha",null,12,null,10,null,8,null,15,null,8,null,70]
[]
["Iš pateikto sąrašo pasirinkite sėjos ir panaikinimo būdą",null,null,null,null,null,"Technikos kainas galite pasitikslinti čia"]
[]
[null,null,{"$f":"IF(C29=\"\",\"\",C29)","v":"Baltosios garstyčios"},null,{"$f":"IF(E29=\"\",\"\",E29)","v":"Vasariniai rapsai"},null,{"$f":"IF(G29=\"\",\"\",G29)","v":"Žieminiai rapsai"},null,{"$f":"IF(I29=\"\",\"\",I29)","v":"Aliejiniai ridikai"},null,{"$f":"IF(K29=\"\",\"\",K29)","v":"Žieminiai rapsiukai"},null,{"$f":"IF(M29=\"\",\"\",M29)","v":"Žieminiai rugiai"}]
[]
["SĖJOS BŪDAS",null,"Sėklų išbarstymas",null,"Sėklų išbarstymas",null,"Tiesioginės sėjos (ražieninė) rapsų sėjamoji",null,"Tiesioginės sėjos (ražieninė) rapsų sėjamoji",null,"Tiesioginės sėjos (ražieninė) rapsų sėjamoji",null,"Tiesioginės sėjos (ražieninė) javų sėjamoji"]
[]
["PANAIKINIMO BŪDAS",null,"Nereikia atskiro panaikinimo",null,"Nereikia atskiro panaikinimo",null,"Kitas",null,"Nereikia atskiro panaikinimo",null,"Seklusis ražienų skutimas",null,"Seklusis ražienų skutimas"]
[]
["SĄNAUDOS, €/ha",null,{"$f":"IF(C29=\"\",\"\",(VLOOKUP(Tool!C168,'Technikos kainos'!$A:$B,2,FALSE)+VLOOKUP(Tool!C170,'Technikos kainos'!$A:$B,2,FALSE)+(C160*C162)))","v":22.91},null,{"$f":"IF(E29=\"\",\"\",(VLOOKUP(Tool!E168,'Technikos kainos'!$A:$B,2,FALSE)+VLOOKUP(Tool!E170,'Technikos kainos'!$A:$B,2,FALSE)+(E160*E162)))","v":16.55},null,{"$f":"IF(G29=\"\",\"\",(VLOOKUP(Tool!G168,'Technikos kainos'!$A:$B,2,FALSE)+VLOOKUP(Tool!G170,'Technikos kainos'!$A:$B,2,FALSE)+(G160*G162)))","v":47.34},null,{"$f":"IF(I29=\"\",\"\",(VLOOKUP(Tool!I168,'Technikos kainos'!$A:$B,2,FALSE)+VLOOKUP(Tool!I170,'Technikos kainos'!$A:$B,2,FALSE)+(I160*I162)))","v":50.69},null,{"$f":"IF(K29=\"\",\"\",(VLOOKUP(Tool!K168,'Technikos kainos'!$A:$B,2,FALSE)+VLOOKUP(Tool!K170,'Technikos kainos'!$A:$B,2,FALSE)+(K160*K162)))","v":57.72},null,{"$f":"IF(M166=\"\",\"\",(VLOOKUP(Tool!M168,'Technikos kainos'!$A:$B,2,FALSE)+VLOOKUP(Tool!M170,'Technikos kainos'!$A:$B,2,FALSE)+(M160*M162)))","v":81.94}]
[]
["GALIMI SUTAUPYMAI"]
[]
["SUTAUPYMAS TRĘŠIMUI AZOTU"]
["Sužinokite galimą sutaupymą tręšimui azotu"]
[]
[null,null,{"$f":"IF(C29=\"\",\"\",C29)","v":"Baltosios garstyčios"},null,{"$f":"IF(E29=\"\",\"\",E29)","v":"Vasariniai rapsai"},null,{"$f":"IF(G29=\"\",\"\",G29)","v":"Žieminiai rapsai"},null,{"$f":"IF(I29=\"\",\"\",I29)","v":"Aliejiniai ridikai"},null,{"$f":"IF(K29=\"\",\"\",K29)","v":"Žieminiai rapsiukai"},null,{"$f":"IF(M29=\"\",\"\",M29)","v":"Žieminiai rugiai"}]
[]
["SUTAUPYMAS TRĘŠIMUI AZOTU, €/ha",null,{"$f":"IF(C29=\"\",\"\",C122*0.8)","v":29.167812809094187},null,{"$f":"IF(E29=\"\",\"\",E122*0.8)","v":17.441918132336166},null,{"$f":"IF(G29=\"\",\"\",G122*0.8)","v":17.441918132336166},null,{"$f":"IF(I29=\"\",\"\",I122*0.8)","v":35.30020464717164},null,{"$f":"IF(K29=\"\",\"\",K122*0.8)","v":16.224529659366432},null,{"$f":"IF(M29=\"\",\"\",M122*0.8)","v":8.8661842232557557}]
[]
["SUTAUPYMAS HERBICIDAMS"]
["Nurodykite naudojamų herbicidų kainą ir sužinokite galimą sutaupymą herbicidams"]
[]
[" HERBICIDO KAINA, €/ha",null,20,null,"nurodykite naudojamo herbicido kainą"]
[]
[null,null,{"$f":"IF(C29=\"\",\"\",C29)","v":"Baltosios garstyčios"},null,{"$f":"IF(E29=\"\",\"\",E29)","v":"Vasariniai rapsai"},null,{"$f":"IF(G29=\"\",\"\",G29)","v":"Žieminiai rapsai"},null,{"$f":"IF(I29=\"\",\"\",I29)","v":"Aliejiniai ridikai"},null,{"$f":"IF(K29=\"\",\"\",K29)","v":"Žieminiai rapsiukai"},null,{"$f":"IF(M29=\"\",\"\",M29)","v":"Žieminiai rugiai"}]
[]
["SUTAUPYMAS HERBICIDAMS, €/ha",null,{"$f":"IF(C29=\"\",\"\",VLOOKUP(C29,'Data base'!$A:$BZ,75,FALSE)*Tool!$C$186/100)","v":18},null,{"$f":"IF(E29=\"\",\"\",VLOOKUP(E29,'Data base'!$A:$BZ,75,FALSE)*Tool!$C$186/100)","v":16},null,{"$f":"IF(G29=\"\",\"\",VLOOKUP(G29,'Data base'!$A:$BZ,75,FALSE)*Tool!$C$186/100)","v":16},null,{"$f":"IF(I29=\"\",\"\",VLOOKUP(I29,'Data base'!$A:$BZ,75,FALSE)*Tool!$C$186/100)","v":18},null,{"$f":"IF(K29=\"\",\"\",VLOOKUP(K29,'Data base'!$A:$BZ,75,FALSE)*Tool!$C$186/100)","v":16},null,{"$f":"IF(M29=\"\",\"\",VLOOKUP(M29,'Data base'!$A:$BZ,75,FALSE)*Tool!$C$186/100)","v":15}]
[]
["GALIMOS IŠMOKOS"]
[]
["Sužinokite apie galimą išmoką pagal KPP Agrarinės aplinkosaugos ir klimato priemonę",null,null,null,null,null,"Paramos sąlygas galite sužinoti čia"]
[]
["DALYVAVIMAS KPP AGRARINĖS APLINKOSAUGOS IR KLIMATO PROGRAMOJE",null,"Taip",null,"pasirinkite iš sąrašo"]
[]
[]
[null,null,{"$f":"IF(C29=\"\",\"\",C29)","v":"Baltosios garstyčios"},null,{"$f":"IF(E29=\"\",\"\",E29)","v":"Vasariniai rapsai"},null,{"$f":"IF(G29=\"\",\"\",G29)","v":"Žieminiai rapsai"},null,{"$f":"IF(I29=\"\",\"\",I29)","v":"Aliejiniai ridikai"},null,{"$f":"IF(K29=\"\",\"\",K29)","v":"Žieminiai rapsiukai"},null,{"$f":"IF(M29=\"\",\"\",M29)","v":"Žieminiai rugiai"}]
[]
["IŠMOKOS DYDIS, €/ha",null,{"$f":"IF(C29=\"\",\"\",IF($C$196=\"Ne\",0,VLOOKUP(C29,'Data base'!$A:$BU,73,FALSE)))","v":134},null,{"$f":"IF(E29=\"\",\"\",IF($C$196=\"Ne\",0,VLOOKUP(E29,'Data base'!$A:$BU,73,FALSE)))","v":0},null,{"$f":"IF(G29=\"\",\"\",IF($C$196=\"Ne\",0,VLOOKUP(G29,'Data base'!$A:$BU,73,FALSE)))","v":0},null,{"$f":"IF(I29=\"\",\"\",IF($C$196=\"Ne\",0,VLOOKUP(I29,'Data base'!$A:$BU,73,FALSE)))","v":134},null,{"$f":"IF(K29=\"\",\"\",IF($C$196=\"Ne\",0,VLOOKUP(K29,'Data base'!$A:$BU,73,FALSE)))","v":0},null,{"$f":"IF(M29=\"\",\"\",IF($C$196=\"Ne\",0,VLOOKUP(M29,'Data base'!$A:$BU,73,FALSE)))","v":0}]
[]
["APIBENDRINIMAS"]
[]
["Susipažinkite su apibendrinta informaciją apie rekomenduojamų augalų sėjos ir panaikinimo sąnaudas bei teikiamą naudą"]
[]
[null,null,{"$f":"IF(C29=\"\",\"\",C29)","v":"Baltosios garstyčios"},null,{"$f":"IF(E29=\"\",\"\",E29)","v":"Vasariniai rapsai"},null,{"$f":"IF(G29=\"\",\"\",G29)","v":"Žieminiai rapsai"},null,{"$f":"IF(I29=\"\",\"\",I29)","v":"Aliejiniai ridikai"},null,{"$f":"IF(K29=\"\",\"\",K29)","v":"Žieminiai rapsiukai"},null,{"$f":"IF(M29=\"\",\"\",M29)","v":"Žieminiai rugiai"}]
[]
["BENDROS SĄNAUDOS, €/ha",null,{"$f":"IF(C29=\"\",\"\",C172)","v":22.91},null,{"$f":"IF(E29=\"\",\"\",E172)","v":16.55},null,{"$f":"IF(G29=\"\",\"\",G172)","v":47.34},null,{"$f":"IF(I29=\"\",\"\",I172)","v":50.69},null,{"$f":"IF(K29=\"\",\"\",K172)","v":57.72},null,{"$f":"IF(M29=\"\",\"\",M172)","v":81.94}]
[]
["GALIMA IŠMOKA, €/ha",null,{"$f":"IF(C29=\"\",\"\",C201)","v":134},null,{"$f":"IF(E29=\"\",\"\",E201)","v":0},null,{"$f":"IF(G29=\"\",\"\",G201)","v":0},null,{"$f":"IF(I29=\"\",\"\",I201)","v":134},null,{"$f":"IF(K29=\"\",\"\",K201)","v":0},null,{"$f":"IF(M29=\"\",\"\",M201)","v":0}]
[]
["SUTAUPYMAI N IR HERBICIDAMS, €/ha",null,{"$f":"C181+C190","v":47.167812809094187},null,{"$f":"E181+E190","v":33.44191813233617},null,{"$f":"G181+G190","v":33.44191813233617},null,{"$f":"I181+I190","v":53.30020464717164},null,{"$f":"K181+K190","v":32.224529659366432},null,{"$f":"M181+M190","v":23.866184223255758}]
[]
[]
["NAUDA, €/ha",null,{"$f":"IF(C29=\"\",\"\",(C211+C213)-C209)","v":158.25781280909419},null,{"$f":"IF(E29=\"\",\"\",(E211+E213)-E209)","v":16.891918132336169},null,{"$f":"IF(G29=\"\",\"\",(G211+G213)-G209)","v":-13.898081867663834},null,{"$f":"IF(I29=\"\",\"\",(I211+I213)-I209)","v":136.61020464717166},null,{"$f":"IF(K29=\"\",\"\",(K211+K213)-K209)","v":-25.495470340633567},null,{"$f":"IF(M29=\"\",\"\",(M211+M213)-M209)","v":-58.07381577674424}]
[]
[]
[]
[]
[]
[]
[]
[]
[]
[]
[]
[]
[]
[]
[]
[]
[null,null,null,null,null,null,null,null,null,null,null,null,"į viršų"]

{"sheet":"Sheet2","index":1,"n_rows":10,"n_cols":2,"rows_kept":10,"cut":false,"hidden":true,"merged":[]}
[]
[]
["Sum of Value","Column Labels"]
["Row Labels","NAUDA, €/ha"]
["Baltosios garstyčios",158.25781280909419]
["Vasariniai rapsai",16.891918132336169]
["Žieminiai rapsai",-13.898081867663834]
["Aliejiniai ridikai",136.61020464717166]
["Žieminiai rapsiukai",-25.495470340633567]
["Žieminiai rugiai",-58.07381577674424]

{"sheet":"Sheet1","index":2,"n_rows":25,"n_cols":9,"rows_kept":25,"cut":false,"hidden":true,"merged":[]}
["Cost item","Catch crop","Value"]
["Sąnaudos, €/ha",{"$f":"IF(Tool!$C$207=\"\",0,Tool!$C$207)","v":"Baltosios garstyčios"},{"$f":"Tool!C209","v":22.91}]
["Sąnaudos, €/ha",{"$f":"IF(Tool!$E$207=\"\",0,Tool!$E$207)","v":"Vasariniai rapsai"},{"$f":"Tool!E209","v":16.55}]
["Sąnaudos, €/ha",{"$f":"IF(Tool!$G$207=\"\",0,Tool!$G$207)","v":"Žieminiai rapsai"},{"$f":"Tool!G209","v":47.34}]
["Sąnaudos, €/ha",{"$f":"IF(Tool!$I$207=\"\",0,Tool!$I$207)","v":"Aliejiniai ridikai"},{"$f":"Tool!I209","v":50.69}]
["Sąnaudos, €/ha",{"$f":"IF(Tool!$K$207=\"\",0,Tool!$K$207)","v":"Žieminiai rapsiukai"},{"$f":"Tool!K209","v":57.72}]
["Sąnaudos, €/ha",{"$f":"IF(Tool!$M$207=\"\",0,Tool!$M$207)","v":"Žieminiai rugiai"},{"$f":"Tool!M209","v":81.94}]
["Galima išmoka, €/ha",{"$f":"IF(Tool!$C$207=\"\",0,Tool!$C$207)","v":"Baltosios garstyčios"},{"$f":"Tool!C211","v":134}]
["Galima išmoka, €/ha",{"$f":"IF(Tool!$E$207=\"\",0,Tool!$E$207)","v":"Vasariniai rapsai"},{"$f":"Tool!E211","v":0}]
["Galima išmoka, €/ha",{"$f":"IF(Tool!$G$207=\"\",0,Tool!$G$207)","v":"Žieminiai rapsai"},{"$f":"Tool!G211","v":0}]
["Galima išmoka, €/ha",{"$f":"IF(Tool!$I$207=\"\",0,Tool!$I$207)","v":"Aliejiniai ridikai"},{"$f":"Tool!I211","v":134}]
["Galima išmoka, €/ha",{"$f":"IF(Tool!$K$207=\"\",0,Tool!$K$207)","v":"Žieminiai rapsiukai"},{"$f":"Tool!K211","v":0},null,null,null,null,null,5]
["Galima išmoka, €/ha",{"$f":"IF(Tool!$M$207=\"\",0,Tool!$M$207)","v":"Žieminiai rugiai"},{"$f":"Tool!M211","v":0}]
["Sutaupymai, €/ha",{"$f":"IF(Tool!$C$207=\"\",0,Tool!$C$207)","v":"Baltosios garstyčios"},{"$f":"Tool!C181+Tool!C190","v":47.167812809094187}]
["Sutaupymai, €/ha",{"$f":"IF(Tool!$E$207=\"\",0,Tool!$E$207)","v":"Vasariniai rapsai"},{"$f":"Tool!E181+Tool!E190","v":33.44191813233617}]
["Sutaupymai, €/ha",{"$f":"IF(Tool!$G$207=\"\",0,Tool!$G$207)","v":"Žieminiai rapsai"},{"$f":"Tool!G181+Tool!G190","v":33.44191813233617}]
["Sutaupymai, €/ha",{"$f":"IF(Tool!$I$207=\"\",0,Tool!$I$207)","v":"Aliejiniai ridikai"},{"$f":"Tool!I181+Tool!I190","v":53.30020464717164}]
["Sutaupymai, €/ha",{"$f":"IF(Tool!$K$207=\"\",0,Tool!$K$207)","v":"Žieminiai rapsiukai"},{"$f":"Tool!K181+Tool!K190","v":32.224529659366432}]
["Sutaupymai, €/ha",{"$f":"IF(Tool!$M$207=\"\",0,Tool!$M$207)","v":"Žieminiai rugiai"},{"$f":"Tool!M181+Tool!M190","v":23.866184223255758}]
["NAUDA, €/ha",{"$f":"IF(Tool!$C$207=\"\",0,Tool!$C$207)","v":"Baltosios garstyčios"},{"$f":"Tool!C216","v":158.25781280909419}]
["NAUDA, €/ha",{"$f":"IF(Tool!$E$207=\"\",0,Tool!$E$207)","v":"Vasariniai rapsai"},{"$f":"Tool!E216","v":16.891918132336169}]
["NAUDA, €/ha",{"$f":"IF(Tool!$G$207=\"\",0,Tool!$G$207)","v":"Žieminiai rapsai"},{"$f":"Tool!G216","v":-13.898081867663834}]
["NAUDA, €/ha",{"$f":"IF(Tool!$I$207=\"\",0,Tool!$I$207)","v":"Aliejiniai ridikai"},{"$f":"Tool!I216","v":136.61020464717166}]
["NAUDA, €/ha",{"$f":"IF(Tool!$K$207=\"\",0,Tool!$K$207)","v":"Žieminiai rapsiukai"},{"$f":"Tool!K216","v":-25.495470340633567}]
["NAUDA, €/ha",{"$f":"IF(Tool!$M$207=\"\",0,Tool!$M$207)","v":"Žieminiai rugiai"},{"$f":"Tool!M216","v":-58.07381577674424}]

{"sheet":"APIE","index":3,"n_rows":23,"n_cols":2,"rows_kept":23,"cut":false,"hidden":false,"merged":[[20,1,20,15],[0,16,0,23],[14,1,14,15],[13,1,13,15],[16,1,16,15],[9,1,9,15],[7,1,7,15],[6,1,6,15],[15,1,15,15],[0,1,0,12],[2,1,2,15],[3,1,3,15],[4,1,4,15],[5,1,5,15]]}
[null,"APIE SPRENDIMŲ PRIĖMIMO ĮRANKĮ"]
[]
[null,"Šis spendimų priėmimo įrankis buvo sukurtas glaudžiai bendradarbiaujant VŠĮ “Aplinkos apsaugos politikos centras” (Lietuva) aplinkosaugos ekspertams ir žemės ūkio ekspertams iš Žemės ūkio išteklių ir ekonomikos instituto (Latvija) bei Vytauto Didžiojo universiteto Žemės ūkio akademijos (Lietuva), įgyvendinant projektą CATCH POLLUTION (LLI-49), kurį finansavo 2014 – 2020 m. Ineterreg Latvijos – Lietuvos bendradarbiavimo programa."]
[null,"Pagrindinis įrankio tikslas – pateikti išsamią informaciją apie tarpinius pasėlius ir pagelbėti ūkininkams pasirenkant tinkamiausius tarpinių pasėlių augalus, geriausiai atitinkančius jų ūkio poreikius. Praplėsdamas žinias apie tarpinius pasėlius ir pateikdamas informaciją apie jų teikiamą naudą ir trūkumus, įrankis skatina platesnį tarpinių pasėlių, kaip perspektyvios agrarinės aplinkosaugos priemonės, naudingos tiek ūkininkui, tiek aplinkai, taikymą Lietuvoje ir Latvijoje."]
[null,"Įrankis apibendrina daugybės mokslinių studijų informaciją, Lietuvos ir Latvijos žemės ūkio ekspertų patirtis bei projekto CATCH POLLUTION rezultatus. Jis apima išsamius duomenis apie 20 augalų, kurie projekto ekspertų buvo įvardinti kaip tinkamiausi augalai posėliniams tarpiniams pasėliams Lietuvoje ir Latvijoje."]
[null,"Atsižvelgiant į nišą tarp pagrindinių pasėlių, sėjomainos rotacijose auginamus augalus, lauko savybes (tokias kaip dirvožemio tipas ir pH), įrankis pasiūlo tinkamiausius posėlinių tarpinių pasėlių augalus konkrečiam laukui. Įrankis taip pat pateikia informaciją apie tikėtiną rekomenduojamų augalų poveikį azoto bei organinės anglies kiekiui dirvožemyje, piktžolėtumo mažinimo galimybes. Šie poveikiai buvo įvertinti projekto metu."]
[null,"Atsižvelgiant į vartotojo pateiktą informaciją apie planuojamus tarpinių pasėlių sėjos ir panaikinimo metodus, sėjos normą ir kainą, įrankis padeda įvertinti ir palyginti skirtingų augalų sėjos ir panaikinimo sąnaudas. Taip pateikia informaciją apie galimus sutaupymus tręšimui azotu bei herbicidams, kuriuos lemia tarpiniuose pasėliuose auginamų augalų geba sulaikyti ir kaupti perteklinį dirvožemio azotą bei stelbti piktžolių augimą. Remiantis įrankyje pateikiamais duomenimis ir skaičiavimais, vartotojas gali palyginti skirtingų augalų savybes, teikiamą naudą, sėjos ir panaikinimo sąnaudas ir pasirinkti tinkamiausią variantą savo ūkiui."]
[null,"Įrankis gali pasitarnauti sudarant tarpinių pasėlių augalų mišinius, kuriuos specialistai rekomenduoja auginti siekiant didesnio ir platesnio efekto. Atsižvelgiant į individualias rekomenduojamų augalų savybes, vartotojas gali sudaryti 3-5 geriausiai jo ūkio poreikius atitinkančių augalų mišinį."]
[]
[null,"Galiausiai, labai svarbu pabrėžti, kad visi įrankio pateikiami duomenys ir rezultatai turi būti vertinami atsargiai, kaip indikatyvūs, nes tarpinių pasėlių poveikis gali labai smarkiai varijuoti priklausomai nuo vietos sąlygų, ūkininkavimo praktikos bei daugelio kitų faktorių. Taip pat reikėtų atsižvelgti į tai, jog įrankis vertina tarpinių pasėlių naudą trumpuoju (vienerių metų) laikotarpiu. Ilgesnėje perspektyvoje tarpiniai pasėliai neabejotinai atneš dar daugiau naudos, tokios kaip pagerėjusi dirvožemio kokybė, biologinė įvairovė, sumažėję erozijos nuostoliai, kurie lems papildomus sutaupymus ūkyje bei geresnį pagrindinių pasėlių derlių. Ir, be abejo, svarbiausia tarpinių pasėlių auginimo nauda yra ta, jog jie sumažina perteklinio dirvožemio azoto išsiplovimą į vandens telkinius ir taip prisideda prie vandens telkinių taršos mažinimo."]
[]
[null,"PAGRINDINIAI LITERATŪROS ŠALTINIAI"]
[]
[null,"SARE (Sustainable Agriculture, Research and Education Programme). 2012. Managing Cover Crops Profitably. Third Edition."]
[null,"Environmental effects of catch crops. 2019. Joint report of Activity A.T.1.1 of LLI-49 project \"Optimal catch crop solutions to reduce pollution in the transboundary  Venta and Lielupe river basins\" (CATCH POLLUTION)."]
[null,"Choosing and managing cover crops in organic agricultural systems. A complementary resource to the technical guide \"Choosing and managing cover crops in organic agricultural systems\" (www.itab.asso.fr)"]
[null,"http://www.covercrop.com/"]
[null,"http://covercrop.org/"]
[]
[]
[null,"Šis įrankis parengtas naudojant Europos Sąjungos finansinę paramą. Už šio įrankio turinį atsako VŠĮ „Aplinkos apsaugos centras“ (Lietuva), Vytauto Didžiojo universiteto Žemės ūkio akademija (Lietuva) ir Žemės ūkio išteklių ir ekonomikos institutas (Latvija). Jokiomis aplinkybėmis negali būti laikoma, kad jis atspindi Europos Sąjungos nuomonę."]
[]
[null,"© VŠĮ \"Aplinkos apsaugos politikos centras\", 2019"]

{"sheet":"Augalų aprašymas","index":4,"n_rows":328,"n_cols":14,"rows_kept":328,"cut":false,"hidden":false,"merged":[[327,3,332,14],[224,3,229,11],[224,13,224,14],[225,13,225,14],[226,13,226,14],[227,13,227,14],[228,13,228,14],[229,13,229,14],[231,3,236,14],[308,13,308,14],[247,3,252,14],[324,13,324,14],[325,13,325,14],[321,13,321,14],[320,13,320,14],[320,3,325,11],[279,3,284,14],[273,13,273,14],[272,13,272,14],[272,3,277,11],[295,3,300,14],[289,13,289,14],[288,13,288,14],[288,3,293,11],[161,13,161,14],[48,13,48,14],[71,3,76,14],[55,3,60,14],[103,3,108,14],[112,3,117,11],[112,13,112,14],[130,13,130,14],[179,13,179,14],[129,13,129,14],[0,1,0,3],[16,3,21,11],[23,3,28,14],[32,3,37,11],[32,13,32,14],[5,3,5,5],[6,3,6,5],[5,8,5,10],[87,3,92,14],[80,3,85,11],[80,13,80,14],[6,8,6,10],[7,3,7,5],[8,3,8,5],[9,3,9,5],[10,3,10,5],[39,3,44,14],[48,3,53,11],[8,8,8,11],[7,8,7,10],[16,13,16,14],[11,3,11,5],[322,13,322,14],[323,13,323,14],[64,3,69,11],[64,13,64,14],[275,13,275,14],[290,13,290,14],[291,13,291,14],[292,13,292,14],[293,13,293,14],[306,13,306,14],[307,13,307,14],[257,13,257,14],[263,3,268,14],[260,13,260,14],[261,13,261,14],[160,3,165,11],[160,13,160,14],[176,13,176,14],[177,13,177,14],[167,3,172,14],[212,13,212,14],[213,13,213,14],[276,13,276,14],[210,13,210,14],[277,13,277,14],[311,3,316,14],[148,13,148,14],[149,13,149,14],[162,13,162,14],[163,13,163,14],[164,13,164,14],[165,13,165,14],[178,13,178,14],[309,13,309,14],[211,13,211,14],[199,3,204,14],[208,3,213,11],[208,13,208,14],[209,13,209,14],[259,13,259,14],[258,13,258,14],[274,13,274,14],[305,13,305,14],[304,13,304,14],[304,3,309,11],[196,13,196,14],[197,13,197,14],[242,13,242,14],[256,3,261,11],[256,13,256,14],[215,3,220,14],[176,3,181,11],[183,3,188,14],[192,3,197,11],[192,13,192,14],[243,13,243,14],[244,13,244,14],[245,13,245,14],[194,13,194,14],[195,13,195,14],[193,13,193,14],[180,13,180,14],[181,13,181,14],[78,0,92,0],[46,0,60,0],[62,0,76,0],[14,0,28,0],[30,0,44,0],[94,0,108,0],[144,13,144,14],[119,3,124,14],[240,3,245,11],[240,13,240,14],[241,13,241,14],[131,13,131,14],[132,13,132,14],[133,13,133,14],[96,3,101,11],[147,13,147,14],[128,3,133,11],[96,13,96,14],[128,13,128,14],[145,13,145,14],[146,13,146,14],[151,3,156,14],[135,3,140,14],[144,3,149,11],[254,0,268,0],[270,0,284,0],[286,0,300,0],[302,0,316,0],[318,0,332,0],[110,0,124,0],[126,0,140,0],[142,0,156,0],[158,0,172,0],[174,0,188,0],[190,0,204,0],[206,0,220,0],[222,0,236,0],[238,0,252,0]]}
[null,"TARPINIŲ PASĖLIŲ AUGALAI"]
[]
[null,"Susipažinkite su rekomenduojamais tarpinių pasėlių augalais"]
[]
[null,"BASTUTINIŲ ŠEIMOS AUGALAI:",null,"PUPINIŲ ŠEIMOS AUGALAI:",null,null,null,null,"VARPINIŲ ŠEIMOS AUGALAI:",null,null,null,null,"KITI:"]
[null,"BALTOJI GARSTYČIA",null,"BALTIEJI DOBILAI",null,null,null,null,"ŽIEMINIAI RUGIAI",null,null,null,null,"GRIKIAI"]
[null,"RUDOJI GARSTYČIA",null,"RAUDONIEJI DOBILAI",null,null,null,null,"GAUSIAŽIEDĖ SVIDRĖ",null,null,null,null,"FACELIJA"]
[null,"VASARINIS RAPSAS",null,"BALTAŽIEDIS BARKŪNAS",null,null,null,null,"DAUGIAMETĖ SVIDRĖ"]
[null,"ŽIEMINIS RAPSAS",null,"VIKIAI",null,null,null,null,"AVIŽOS IR JUODOSIOS AVIŽOS"]
[null,"ALIEJINIS RIDIKAS",null,"ŽIRNIAI"]
[null,"PAŠARINIS RIDIKAS",null,"PUPOS"]
[null,"RAPSUKAS",null,"SIAURALAPIAI LUBINAI"]
[]
[]
[null,"BALTOJI GARSTYČIA (Sinapis alba L.)"]
[]
[null,null,null,"Vienmetis žolinis augalas. Sėklos - gelsvos arba šiek tiek rudos, 0.2 cm skersmens, vidinis sėklų sluoksnis gleivėtas. Vaisiai - daugiasėklė, tankiai plaukuota, 2 – 4 cm ilgio ankštara. Stiebas - vertikalus, šakotas, standus, šiurkštus. Lapai - skiautėti, sudaryti iš 3 - 5 apvalių segmentų, švelniai plaukuoti, 8 cm ilgio ir 4 cm pločio. Žiedai - spinduliški, taisyklingos, platėjančios formos, geltoni, plaukuoti, atviri, iš keturių žiedlapių, 0.7 – 0.1 cm ilgio.  Šaknys - plačiai išsišakoję, 30 – 90 cm ilgio.",null,null,null,null,null,null,null,null,null,"Rekomenduojamas sėjos laikotarpis: liepa – rugpjūtis"]
[null,null,null,null,null,null,null,null,null,null,null,null,null,"Aukštis: 30 - 60 cm"]
[null,null,null,null,null,null,null,null,null,null,null,null,null,"Sėjos gylis: 1 - 2 cm"]
[null,null,null,null,null,null,null,null,null,null,null,null,null,"Sėjos norma: 10 - 15 kg/ha"]
[null,null,null,null,null,null,null,null,null,null,null,null,null,"Atsparumas šalčiui: ne"]
[]
[]
[null,null,null,"Auginimas. Baltosios garstyčios gerai auga lengvame dirvožemyje, kuriame yra tinkamas drenažas, bet gali augti ir sunkiose dirvose. Tinkamas dirvožemio pH svyruoja tarp 4,5 ir 8,2. Šiam augalui netinka labai drėgnos dirvos.Geros kokybės baltosios garstyčios užauga dirvožemyje, kuriame yra daug maistinių medžiagų. Tai vienmetis augalas, kuris greitai auga. Sėklos sudygsta mažiau nei per savaitę. Privalumai: greitai auga, sulaiko ir nuo išsiplovimo apsaugo daug azoto, liekanos greitai mineralizuojasi palikdamos dirvožemyje daug augalams prieinamo mineralinio azoto, teigiamai veikia dirvožemio struktūrą, mažina eroziją, gerai stelbia piktžoles, naikina nematodus, leidžia išvengti gybelinių ligų. Trūkumai: netoleruoja vandens ir maistinių medžiagų trūkumo, sausose ir šiltose vietovėse per greitai vystosi ir yra pavojus sumedėti, jautrios kenkėjams ir ligoms, ypatingai jei nesilaikoma sėjomainos reikalavimų."]
[]
[]
[]
[]
[]
[]
[null,"RUDOJI GARSTYČIA (Brassica juncea L. Czern.)"]
[]
[null,null,null,"Stiebas - vertikalus, pilkai žalias, plaukuotas, šakos išsibarsčiusios, viršutinėje dalyje ilgėjančios ir kylančios į viršų. Lapai - ovalūs, platėjantys toliau nuo stiebo, pilkai žali, įvairiai dantytais, karpytais arba klostuotais kraštais. Žiedai - taisyklingos, platėjančios formos, geltoni, iš keturių žiedlapių, 0.7 – 0.1 cm ilgio. Vaisiai - ankštara, 2 – 6.5 cm ilgio. Šaknys - plačiai išsišakoję, 30 – 90 cm ilgio. Sėklos - apvalios, 0.1 – 0.15 cm skersmens, smulkiai tinkliškos, šviesiai arba tamsiai rudos spalvos.",null,null,null,null,null,null,null,null,null,"Rekomenduojamas sėjos laikotarpis: birželis - liepa"]
[null,null,null,null,null,null,null,null,null,null,null,null,null,"Aukštis: 90 - 200 cm"]
[null,null,null,null,null,null,null,null,null,null,null,null,null,"Sėjos gylis: 1-2 cm"]
[null,null,null,null,null,null,null,null,null,null,null,null,null,"Sėjos norma: 5 - 10 kg/ha"]
[null,null,null,null,null,null,null,null,null,null,null,null,null,"Atsparumas šalčiui: ne"]
[]
[]
[null,null,null,"Auginimas. Gerai auga sunkiame, nusausintame, derlingame dirvožemyje. Toleruoja didelį kritulių kiekį ir, nors ir gana giliai įsišakniję, nėra atsparūs sausrai. Tinkamas dirvožemio pH - 4,3 - 8,3. Gerai auga kai oro temperatūra yra aukšta ir stabili. Augalas yra prisitaikęs augti prie trumpų dienų. Privalumai: sulaiko ir nuo išsiplovimo apsaugo daug azoto, liekanos greitai mineralizuojasi palikdamos dirvožemyje daug augalams prieinamo mineralinio azoto, teigiamai veikia dirvožemio struktūrą, mažina eroziją, gerai stelbia piktžoles, turi stiprų alelopatinį poveikį, leidžia išvengti grybelinių ligų, naikina parazitus, mažina nematodų skaičių. Trūkumai: netoleruoja vandens ir maistinių medžiagų trūkumo, prastai auga blogai sausinamose žemėse, jei nesilaikoma sėjomainos reikalavimų, atsiranda ligų rizika."]
[]
[]
[]
[]
[]
[]
[null,"VASARINIS RAPSAS (Brassica napus L. ssp. oleifera)"]
[]
[null,null,null,"Vienmetis arba dvimetis augalas. Stiebas - vertikalus, šakotas. Lapai - melsvai žali, pakaitiniai, su trumpais lapkočiais apačioje ir be lapkočių viršuje, blizgūs, pailgi, apatiniai - lengvai skiautėti, viršutiniai - lygiais kraštais. Žiedai - spinduliški, taisyklingos formos, geltoni, 1 – 1.5 cm ilgio, atviri, iš keturių žiedlapių, kurių ilgis 0.1 – 0.15 cm. Vaisius - daugiasėklė, 5 – 8 cm ilgio ankštara. Sėklos - taisyklingai išdėstytos ankštaroje, 0.35 – 0.5 cm storio. Šaknys - ilgos,  plačiai išsišakojusios, pailgos ir gumbuotos.",null,null,null,null,null,null,null,null,null,"Rekomenduojamas sėjos laikotarpis: birželis – rugpjūtis"]
[null,null,null,null,null,null,null,null,null,null,null,null,null,"Aukštis: 100 - 150 cm"]
[null,null,null,null,null,null,null,null,null,null,null,null,null,"Sėjos gylis: 1– 2,5 cm"]
[null,null,null,null,null,null,null,null,null,null,null,null,null,"Sėjos norma: 10-20 kg/ha"]
[null,null,null,null,null,null,null,null,null,null,null,null,null,"Atsparumas šalčiui: ne"]
[]
[]
[null,null,null,"Auginimas. Augalas gali augti įvairiuose dirvožemiuose, tačiau, labiausiai tinka lengvos ir gerai drenuotos dirvos, kurių pH aukštesnis nei 5.5. Tankus dirvožemis riboja įsišaknijimą, kas gali lemti mažesnį maistinių medžiagų ir vandens įsisavinimą. Privalumai: labai gerai stelbia piktžoles, gerina dirvožemio struktūrą, sulaiko ir apsaugo nuo išsiplovimo azotą.Trūkumai: kenkėjų ir ligų (šaknų gumbo) rizika, ypatingai jei nesilaikoma sėjomainos reikalavimų."]
[]
[]
[]
[]
[]
[]
[null,"ŽIEMINIS RAPSAS (Brassica napus L. napus)"]
[]
[null,null,null,"Vienmetis arba dvimetis augalas. Stiebas - vertikalus, šakotas, šiek tiek purpurinis apačioje. Lapai - vaškiniai, apačia lygi, platėjantys, apglėbiantys stiebą, beplaukiai, mėsingi ir melsvai žali. Žiedai - šviesiai geltoni, 1.2 – 1.5 cm ilgio, atviri, neužgožiantys žiedyno pumpurų. Sėklos - taisyklingai išdėstytos ankštaroje, 0.35 – 0.5 cm storio. Šaknys - ilgos,  plačiai išsišakojusios pailgos ir gumbuotos.",null,null,null,null,null,null,null,null,null,"Rekomenduojamas sėjos laikotarpis: birželis – rugpjūtis"]
[null,null,null,null,null,null,null,null,null,null,null,null,null,"Aukštis: 66 - 150 cm"]
[null,null,null,null,null,null,null,null,null,null,null,null,null,"Sėjos gylis: 1 – 2,5 cm"]
[null,null,null,null,null,null,null,null,null,null,null,null,null,"Sėjos norma: 8-20 kg / ha"]
[null,null,null,null,null,null,null,null,null,null,null,null,null,"Atsparumas šalčiui: taip"]
[]
[]
[null,null,null,"Auginimas. Labiausiai tinka lengvos ir gerai drenuotos dirvos, kurių pH yra nuo 5,5 iki 8,3. Privalumai: išaugina daug biomasės, sulaiko ir nuo išsiplovimo apsaugo daug azoto, gerai stelbia piktžoles, gerina dirvožemio struktūrą. Trūkumai: gali būti sudėtinga panaikinti ir išvengti atžėlimo, ligų (t.y. šaknų gumbo) rizika, jei nesilaikoma sėjomainos reikalavimų."]
[]
[]
[]
[]
[]
[]
[null,"ALIEJINIS RIDIKAS (Raphanus sativus L.)"]
[]
[null,null,null,"Vienmetis augalas. Stiebas - šakotas, lygus. Lapai - giliai įkirpti, augantys aplink stiebą. Šaknys - šakotos, storos, baltos, 2 - 5 cm skersmens, 30 cm ilgio. Žiedai - rausvi, balti ar melsvi, keturi žiedlapiai. Sėklos – 0.25 – 0.4 cm, sferinės formos.",null,null,null,null,null,null,null,null,null,"Rekomenduojamas sėjos laikotarpis: birželis – rugpjūtis"]
[null,null,null,null,null,null,null,null,null,null,null,null,null,"Aukštis: 90 - 130 cm"]
[null,null,null,null,null,null,null,null,null,null,null,null,null,"Sėjos gylis: 1 - 2 cm"]
[null,null,null,null,null,null,null,null,null,null,null,null,null,"Sėjos norma: 10 - 25 kg/ha"]
[null,null,null,null,null,null,null,null,null,null,null,null,null,"Atsparumas šalčiui: ne"]
[]
[]
[null,null,null,"Auginimas. Nereiklūs dirvai, gerai auga priemolio, priesmėlio ir netgi smėlio dirvose. Tinkamiausias dirvožemio pH - nuo 6 iki 7,5. Sparčiai auga, kai pasėjamas vasaros pabaigoje. Po 3 savaičių jau uždengia dirvožemį. Privalumai:  tolerantiškas sausrai, sukaupia ir nuo išsiplovimo apsaugo daug azoto, liekanos greitai mineralizuojasi dirvožemyje palikdamos daug augalams prieinamo mineralinio azoto, gerai stelbia piktžoles, naikina nematodus. Trūkumai: augalui netinka šlapios dirvos, azoto trūkumas gali riboti gebėjimą konkuruoti su piktžolėmis, nesilaikant sėjomainos reikalavimų kyla ligų rizika."]
[]
[]
[]
[]
[]
[]
[null,"PAŠARINIS RIDIKAS (Raphanus sativus var.oleifer)"]
[]
[null,null,null,"Vienmetis augalas. Stiebas - šakotas, lygus. Lapai - giliai įkirpti, augantys aplink stiebą. Šaknys - šakotos, storos, baltos, 5 - 15 cm ilgio. Žiedai - rausvi, balti ar melsvi, keturi žiedlapiai. Sėklos – 0.25 – 0.4 cm, sferinės formos.",null,null,null,null,null,null,null,null,null,"Rekomenduojamas sėjos laikotarpis: liepa"]
[null,null,null,null,null,null,null,null,null,null,null,null,null,"Aukštis: 50 - 90 cm"]
[null,null,null,null,null,null,null,null,null,null,null,null,null,"Sėjos gylis: 1 - 2 cm"]
[null,null,null,null,null,null,null,null,null,null,null,null,null,"Sėjos norma: 8 - 12 kg/ha"]
[null,null,null,null,null,null,null,null,null,null,null,null,null,"Atsparumas šalčiui: ne"]
[]
[]
[null,null,null,"Auginimas. Ridikas greitai auga jeigu dirvožemyje yra daug maisto medžiagų ir pakanka drėgmės. Tinkamiausias dirvožemio pH - nuo 6,0 iki 7,5. Privalumai:  sukaupia ir nuo išsiplovimo apsaugo daug azoto, liekanos greitai mineralizuojasi dirvožemyje palikdamos daug augalams prieinamo mineralinio azoto, mažina eroziją, dėl greitos infiltracijos, kurią palengvina atviros šaknų padarytos skylės, sumažėja nuotėkis ir dirvožemio dalelių pernešimas, purenamas dirvožemis, naikina nematodus.  Trūkumai: netoleruoja pavėsio, stovinčio vandens, azoto trūkumo dirvožemyje ir -7 ⁰C ar žemesnių temperatūrų, nesilaikant sėjomainos reikalavimų kyla ligų rizika."]
[]
[]
[]
[]
[]
[]
[null,"RAPSUKAS (Brassica rapa L. ssp. rapa)"]
[]
[null,null,null,"Vienmetis ir dvimetis augalas. Stiebas - plačiai šakotas. Lapai - šviesiai arba vidutiniškai žali, plaukuoti arba šėriuoti, 30 – 50 cm ilgio, pilkai žalias lapkotis kartais prigludęs prie stiebo. Šaknys - plačiai šakotos, 15 – 17 cm ilgio. Žiedai - ryškiai geltoni, dažniausiai stiebo viršūnėje, iš keturių 0.06 – 0.12 cm ilgio žiedlapių. Sėklos – 0.15 – 0.2 cm skersmens, juodos arba rausvai rudos, apvalios.",null,null,null,null,null,null,null,null,null,"Rekomenduojamas sėjos laikotarpis: birželis – rugpjūtis"]
[null,null,null,null,null,null,null,null,null,null,null,null,null,"Aukštis: 30 - 90 cm"]
[null,null,null,null,null,null,null,null,null,null,null,null,null,"Sėjos gylis: 2 cm"]
[null,null,null,null,null,null,null,null,null,null,null,null,null,"Sėjos norma: 5 - 10 kg/ha"]
[null,null,null,null,null,null,null,null,null,null,null,null,null,"Atsparumas šalčiui: taip"]
[]
[]
[null,null,null,"Auginimas. Gerai auga priemolyje, derlingame ir šiek tiek rūgščiame dirvožemyje. Tinkmas pH - nuo 5,3 iki 6,8. Augimą riboja molis ir šlapios dirvos. Augalas yra atsparus šalčiui ir sausrai. Pasėti liepos mėnesį, biomasę augina nuo rugsėjo iki lapkričio. Sparčiausiai šaknys auga rudenį, esant žemai temperatūrai. Privalumai: sulaiko ir nuo išsiplovimo apsaugo azotą, šaknys gerina dirvožemio struktūrą, gerai stelbia piktžoles. Trūkumai: netinka užmirkusiose, nederlingose dirvose, netoleruoja pavėsio, nesilaikant sėjomainos reikalavimų kyla ligų rizika."]
[]
[]
[]
[]
[]
[]
[null,"BALTIEJI DOBILAI (Trifolium repens L)"]
[]
[null,null,null,"Daugiametis augalas. Stiebas - labai arti žemės paviršiaus, šaknys auga iš bamblių, lygus. Lapai - iš 3 ovalių, plačių lapelių, su baltomis dėmelėmis. Šaknys – ant vienos pagrindinės auga šakniaplaukiai. Žiedai - apvalus žiedynas ilgo stiebo viršuje, baltais arba rožiniais atspalviais. Sėklos - širdies formos, lygiu paviršiumi, nuo ryškiai geltonų iki gelsvai rudų atspalvių.",null,null,null,null,null,null,null,null,null,"Rekomenduojamas sėjos laikotarpis: birželis"]
[null,null,null,null,null,null,null,null,null,null,null,null,null,"Aukštis: 10 - 30 cm"]
[null,null,null,null,null,null,null,null,null,null,null,null,null,"Sėjos gylis: 0,4 - 0,5 cm"]
[null,null,null,null,null,null,null,null,null,null,null,null,null,"Sėjos norma: 8 - 10 kg/ha"]
[null,null,null,null,null,null,null,null,null,null,null,null,null,"Atsparumas šalčiui: taip"]
[]
[]
[null,null,null,"Auginimas. Tai - daugiametis, žemaūgis augalas, toleruojantis pavėsį ir šiek tiek rūgščią dirvą, šaltį ir drėgmę. Auga įvairiuose dirvožemiuose, bet geriausiai molyje ar priemolyje. Tinkamas pH intervalas yra nuo 5,5 iki 7,0. Privalumai: iš atmosferos fiksuoja daug azoto, liekanoms mineralizuojantis palieka sukauptą azotą dirvožemyje, gerina dirvožemio struktūrą, patveresni ir tvirtesni nei kti dobilai. Trūkumai: lėtas įsitvirtinimas ir augimas, gali pernešti šaknų puvinį, pritraukia peles ir kitus graužikus."]
[]
[]
[]
[]
[]
[]
[null,"RAUDONIEJI DOBILAI (Trifolium pratense L.)"]
[]
[null,null,null,"Daugiametis augalas. Stiebas - cilindrinis, tuščiaviduris, plaukuotas, 4 šakos viename stiebe. Lapai - iš 3 ovalių, plačių lapelių, su baltomis dėmelėmis. Šaknys – ant vienos pagrindinės auga šakniaplaukiai. Žiedai - violetinei raudoni, 0.12 – 0.18 cm ilgio, žiedynas - viršuje stiebo. Sėklos - trumpos, ovalios, geltonos arba tamsiai violetinės.",null,null,null,null,null,null,null,null,null,"Rekomenduojamas sėjos laikotarpis: birželis"]
[null,null,null,null,null,null,null,null,null,null,null,null,null,"Aukštis: 15 - 50 cm"]
[null,null,null,null,null,null,null,null,null,null,null,null,null,"Sėjos gylis: 0,4 - 0,5 cm"]
[null,null,null,null,null,null,null,null,null,null,null,null,null,"Sėjos norma: 10 - 15 kg/ha"]
[null,null,null,null,null,null,null,null,null,null,null,null,null,"Atsparumas šalčiui: taip"]
[]
[]
[null,null,null,"Auginimas. Geriausiai auga drėgnose, vėsiose sąlygose, optimalios augti yra humusingos molio ir priemolio nerūgščios dirvos, kurių pH yra nuo 6,0 iki 7,0. Toleruoja šešėlį. Pradžioje auga lėtai. Privalumai: gerai įsišaknija, išaugina didelę biomasę (ypatingai mišiniuose), iš atmosferos fiksuoja daug azoto, liekanoms mineralizuojantis palieka mineralinį azotą dirvožemyje, gerai kovoja su piktžolėmis, pluoštinė šaknų sistema teigiamai veikia dirvožemio struktūrą. Trūkumai: lėtas augimas pradžioje, platina šaknų puvinį."]
[]
[]
[]
[]
[]
[]
[null,"BALTAŽIEDIS BARKŪNAS (Melilotus alba L.)"]
[]
[null,null,null,"Dvimetis augalas. Stiebas - vertikalus, vienas, gerai šakotas, šeriuotas. Lapai - pakaitiniai, iš trijų dalių, ovalūs, dantyti, 1 - 2.5 cm ilgio. Šaknys - giliai ir plačiai įsišakniję. Žiedai - pailgi, balti žiedynai, 0.4 - 0. 5 cm ilgio, išsidėstę ant ilgo stiebo. Sėklos - kūginės, 0.3 – 0.5 cm ilgio, nuo rusvai geltonos iki rudos spalvos, raukšlėto paviršiaus.",null,null,null,null,null,null,null,null,null,"Rekomenduojamas sėjos laikotarpis: birželis"]
[null,null,null,null,null,null,null,null,null,null,null,null,null,"Aukštis: 30 - 150 cm"]
[null,null,null,null,null,null,null,null,null,null,null,null,null,"Sėjos gylis: 2-3 cm"]
[null,null,null,null,null,null,null,null,null,null,null,null,null,"Sėjos norma: 20 kg/ha"]
[null,null,null,null,null,null,null,null,null,null,null,null,null,"Atsparumas šalčiui: taip"]
[]
[]
[null,null,null,"Auginimas. Dirvožemiams nereiklus, gerai auga priesmėlio, priemolio ir molio dirvožemiuose. Optimalus pH intervalas yra 6,5 - 7,5. Įsitvirtinana lėtai. Jautriai reaguoja į dirvožemio derlingumą, ypatingai P ir K atsargas. Privalumai: turi ilgas ir stiprias šaknis, gerai pakenčia sausras, purena dirvožemį ir leidžia išvengti suslėgimo problemų, praturtina dirvą azotu, žydėdamas gausiai išskiria nektarą ir pritraukia bites. Trūkumai: dėl lėto įsitvirtinimo gali kilti problemų su piktžolėmis."]
[]
[]
[]
[]
[]
[]
[null,"VIKIAI (Vicia villosa Roth)"]
[]
[null,null,null,"Vienmetis ar dvimetis augalas. Stiebas – plonas, 0.2 – 0.6 cm skersmens, 80 - 100 cm ilgio, lankstus, tankiai plaukuotas, šakotas (3-10 atšakos), turi ūselius. Lapai - sudėtiniai, iš 5 - 10 siaurai pailgų, atskirų, porinių lapelių, plunksniški, plaukuoti. Šaknys - seklios, plačiai šakotos. Žiedai - violetiniai ar nuo baltų iki rožinių atspalvių, nuo 10 iki 40 kekių, ilgesni nei lapai. Sėklos - apvalios, juodos, auga pailgose ir plokščiose ankštyse, kurių skersmuo 0.2 – 0.5 cm.",null,null,null,null,null,null,null,null,null,"Rekomenduojamas sėjos laikotarpis: birželis - rugpjūtis"]
[null,null,null,null,null,null,null,null,null,null,null,null,null,"Aukštis: 45 - 70 cm"]
[null,null,null,null,null,null,null,null,null,null,null,null,null,"Sėjos gylis: 2-4 cm"]
[null,null,null,null,null,null,null,null,null,null,null,null,null,"Sėjos norma: 30 - 50 kg/ha"]
[null,null,null,null,null,null,null,null,null,null,null,null,null,"Atsparumas šalčiui: taip"]
[]
[]
[null,null,null,"Auginimas. Gali augti įvairiose dirvožemiuose nuo smėlio iki sunkaus molio. Toleruoja pH nuo 5 iki 7,5, tačiau geriausiai auga dirvožemiuose, kurių pH yra 6 - 7. Reikalauja nemažo fosforo ir kalio kiekio.  Iš dalies toleruoja pavėsį. Privalumai: sukaupia daug azoto, liekanos greitai mineralizuojasi dirvožemyje palikdamos daug kitiems augalams prieinamo mineralinio azoto, gerina vandens infiltraciją, purena dirvožemį, turi alelopatinį poveikį, stelbia piktžoles. Trūkumai: gali tapti piktžole, perneša šaknų puvinį."]
[]
[]
[]
[]
[]
[]
[null,"ŽIRNIAI (Pisum sativum L.)"]
[]
[null,null,null,"Vienmetis augalas. Stiebas - tuščiaviduris, negali augti į viršų be atramos, turi ūselius. Lapai - sudėtiniai, pakaitiniai, ovalūs, išsidėstę vienas priešais kitą, nuo 1 iki 4 porų. Žiedai - skirtingų dydžių (nuo 1.3 iki 3.5 cm), 1 - 4 žiedynai, kurie išauga iš lapų pažastų. Sėklos - apvalios, lygios arba raukšlėtos, žalios, geltonos,  rudos, raudonos oranžinės, neryškios, tamsiai violetinės ar beveik juodos, taškuotos. Šaknys - seklios, viena pagrindinė šaknis su šoninėmis, 150 cm. ilgio.",null,null,null,null,null,null,null,null,null,"Rekomenduojamas sėjos laikotarpis: birželis - rugpjūtis"]
[null,null,null,null,null,null,null,null,null,null,null,null,null,"Aukštis: 45 - 70 cm"]
[null,null,null,null,null,null,null,null,null,null,null,null,null,"Sėjos gylis: 4 - 6 cm"]
[null,null,null,null,null,null,null,null,null,null,null,null,null,"Sėjos norma: 100 - 250 kg/ha"]
[null,null,null,null,null,null,null,null,null,null,null,null,null,"Atsparumas šalčiui: ne"]
[]
[]
[null,null,null,"Auginimas. Gerai auga įvairiuose dirvožemiuose, bet geriausiai - derlinguose, gerai nusausintuose, kuriuose yra daug fosforo ir kalio. Jautrūs dirvožemio druskingumui ir rūgštingumui. Tinkamas dirvožemio pH žirnių augimui yra 5,5 – 7,0. Privalumai: išaugina didelę biomasę, sukaupia daug azoto, liekanos greitai mineralizuojasi dirvožemyje palikdamos daug kitiems augalams prieinamo mineralinio azoto.Trūkumai: daigai neatsparūs sausrai, prastai stelbia piktžoles, perneša šaknų puvinį."]
[]
[]
[]
[]
[]
[]
[null,"PUPOS (Vicia faba)"]
[]
[null,null,null,"Vienmetis žolinis augalas. Turi ilgą liemeninę šaknį ir statų stiebą. Lapai poromis priešiškai plunksniški. Žiedai balti, ant papėdlapių juodomis aksominėmis dėmėmis, po 5-8 susitelkę kekėse. Vaisius – nuo 4 iki 20 cm ilgio ankštis.",null,null,null,null,null,null,null,null,null,"Rekomenduojamas sėjos laikotarpis: birželis - rugpjūtis"]
[null,null,null,null,null,null,null,null,null,null,null,null,null,"Aukštis: 60 - 180 cm"]
[null,null,null,null,null,null,null,null,null,null,null,null,null,"Sėjos gylis: 6 - 10 cm"]
[null,null,null,null,null,null,null,null,null,null,null,null,null,"Sėjos norma: 180 - 220 kg/ha"]
[null,null,null,null,null,null,null,null,null,null,null,null,null,"Atsparumas šalčiui: ne"]
[]
[]
[null,null,null,"Auginimas. Auga molio ir priemolio dirvožemiuose, gerai supurentoje dirvoje, toleruoja gana didelį pH intervalą (nuo 4,5 iki 8,3), tačiau geriausiai auga mažo rūgštingumo, neutralios reakcijos dirvožemiuose, kurių pH 6,5 - 7. Netoleruoja sausros ir ilgo užmirkimo. Privalumai: išaugina didelę biomasę, sukaupia daug azoto, liekanos greitai mineralizuojasi dirvožemyje palikdamos daug kitiems augalams prieinamo mineralinio azoto, šaknų sistema gerina dirvožemio struktūrą. Trūkumai: sėklos didelės, tad sudėtinga sėti ir ruošti mišinius, prastai stelbia piktžoles."]
[]
[]
[]
[]
[]
[]
[null,"SIAURALAPIAI LUBINAI (Lupinus angustifolius)"]
[]
[null,null,null,"Žolinis savidulkis augalas. Stiebai statūs, nešakoti, lapai pirštiški. Žiedai sukrauti daugiažiedėse kekėse. Ankštys pūkuotos, pailgos ir atsidarančios. Jose yra įstrižos pertvaros tarp sėklų.",null,null,null,null,null,null,null,null,null,"Rekomenduojamas sėjos laikotarpis: birželis"]
[null,null,null,null,null,null,null,null,null,null,null,null,null,"Aukštis: 60 - 100 cm"]
[null,null,null,null,null,null,null,null,null,null,null,null,null,"Sėjos gylis: 3 - 4 cm"]
[null,null,null,null,null,null,null,null,null,null,null,null,null,"Sėjos norma: 100 - 150 kg/ha"]
[null,null,null,null,null,null,null,null,null,null,null,null,null,"Atsparumas šalčiui: ne"]
[]
[]
[null,null,null,"Auginimas. Geriausiai auga lengvuose, šiek tiek rūgščiuose dirvožemiuose. Privalumai: išaugina didelę biomasę, sukaupia daug azoto, liekanos greitai mineralizuojasi dirvožemyje palikdamos daug kitiems augalams prieinamo mineralinio azoto, asimiliuoja fosforą, šaknų sistema gerina dirvožemio struktūrą, mažina suslėgimą. Trūkumai: prastai stelbia piktžoles, jautrūs virusinėms ir grybelinėms ligoms."]
[]
[]
[]
[]
[]
[]
[null,"ŽIEMINIAI RUGIAI (Secale cereale L.)"]
[]
[null,null,null,"Vienmetis augalas. Stiebas - vertikalus, tuščiaviduris, 6 - 7 tarpubambliai, geltonas (subrendęs), blizgus. Lapai - siauri, pailgi, auga pakaitomis ant stiebo. Šaknys - kuokštinės, 3 – 4 pirminės, 0.5 – 2 cm ilgio. Žiedai - sudėtinė varpa, ne tipinės struktūros. Sėklos - pailgi, ovalūs, plokšti grūdai, baltos, geltonos, rudos arba žalios spalvos. Vaisiai - ovalus grūdas, 0.8 – 1 cm ilgio.",null,null,null,null,null,null,null,null,null,"Rekomenduojamas sėjos laikotarpis: birželis – rugpjūtis"]
[null,null,null,null,null,null,null,null,null,null,null,null,null,"Aukštis: 70 - 140 cm"]
[null,null,null,null,null,null,null,null,null,null,null,null,null,"Sėjos gylis: 2 - 5 cm"]
[null,null,null,null,null,null,null,null,null,null,null,null,null,"Sėjos norma: 70 - 90 kg/ha"]
[null,null,null,null,null,null,null,null,null,null,null,null,null,"Atsparumas šalčiui: taip"]
[]
[]
[null,null,null,"Auginimas. Auginimui tinka lengvi priemoliai arba smėliai, sudygsta net ir palyginti sausame dirvožemyje. Auga ir sunkiuose moliuose, nusausintuose ar drėgnose dirvožemiuose. Gali sudygti ir labai vėsiu oru. Privalumai: sulaiko perteklinį azotą, labai gerai stelbia piktžoles, pluoštinė šaknų sistema saugo dirvožemį nuo erozijos, liekanos praturtina dirvožemį organine anglimi. Trūkumai: po įterpimo kuriam laikui gali imobilizuoti dirvožemio azotą."]
[]
[]
[]
[]
[]
[]
[null,"GAUSIAŽIEDĖ SVIDRĖ (Lolium perenne L. ssp. multiflorum)"]
[]
[null,null,null,"Vienmetis ar dvimetis augalas. Stiebas - vertikalus. Lapai - ilgi, siauri, tvirti, ryškus, nuo šviesiai žalių iki šviesiai rausvai žalių, blizgūs, lygūs. Šaknys – pluoštinės. Žiedai - atviri. Sėklos – 0.3 – 0.55 cm ilgio, 0.07 – 0.15 cm pločio.",null,null,null,null,null,null,null,null,null,"Rekomenduojamas sėjos laikotarpis: birželis"]
[null,null,null,null,null,null,null,null,null,null,null,null,null,"Aukštis: 30 - 65 cm"]
[null,null,null,null,null,null,null,null,null,null,null,null,null,"Sėjos gylis: 1 cm"]
[null,null,null,null,null,null,null,null,null,null,null,null,null,"Sėjos norma: 20 - 30 kg/ha"]
[null,null,null,null,null,null,null,null,null,null,null,null,null,"Atsparumas šalčiui: taip"]
[]
[]
[null,null,null,"Auginimas. Toleruoja suspaustus dirvožemius, geriausiai auga priemoliuose ir derlingose, drėgnose dirvose. Privalumai: kaupia azoto perteklių, tanki pluoštinė šaknų sistema mažina dirvožemio eroziją, gerina dirvožemio struktūrą, mažina suslėgimą, didina organinės anglies kiekį dirvožemyje. Trūkumai: laiku neįterpta  barsto sėklas ir savaime atsisėja, gali virsti piktožole, neatsparios vainikuotosiomis ir rudosiomis rūdimis (Puccinia spp.), pritraukia amarus, po įterpimo kuriam laikui imobilizuoja dirvožemio azotą."]
[]
[]
[]
[]
[]
[]
[null,"DAUGIAMETĖ SVIDRĖ (Lolium perenne L.)"]
[]
[null,null,null,"Daugiametis augalas. Stiebas - vertikalus, tvirtas, lygus. Lapai - ilgi, siauri, tvirti, tamsiai žali, lygaus paviršiaus. Šaknys - kuokštinės. Žiedai - atviri. Sėklos – 0.3 – 0.55 cm. ilgio, siauros, pailgos, gelsvai rudos.",null,null,null,null,null,null,null,null,null,"Rekomenduojamas sėjos laikotarpis: birželis"]
[null,null,null,null,null,null,null,null,null,null,null,null,null,"Aukštis: 80 - 90 cm"]
[null,null,null,null,null,null,null,null,null,null,null,null,null,"Sėjos gylis: 1 - 2 cm"]
[null,null,null,null,null,null,null,null,null,null,null,null,null,"Sėjos norma: 20-25 kg/ha"]
[null,null,null,null,null,null,null,null,null,null,null,null,null,"Atsparumas šalčiui: taip"]
[]
[]
[null,null,null,"Auginimas. Geriausiai auga nusausintuose, derlinguose, neutralaus pH, molinguose dirvožemiuose. Netoleruoja perdžiuvusios arba įmirkusios dirvos. Dirvožemio struktūra nėra svarbi. Gali augti ir smėlinguose dirvose, bet turi pakakti vandens ir maistinių medžiagų. Rečiau auga durpynuose. Privalumai: greitai dygsta, atspari ligoms bei sausra, mažina eroziją, gerina dirvožemio struktūrą, didina organinės anglies kiekį. Trūkumai: laiku neįterpta gali virsti piktožole, po įterpimo kuriam laikui imobilizuoja dirvožemio azotą."]
[]
[]
[]
[]
[]
[]
[null,"AVIŽOS IR JUODOSIOS AVIŽOS (Avena sativa L & Avena strigosa L.)"]
[]
[null,null,null,"Vienmetis augalas. Stiebas - vertikalus, pasviręs, švelnus, lygus, 0.3 – 0.6 cm storio. Lapai - pailgi, smailėjantys, plokšti, grublėti, žali arba melsvai pilki, 20 - 45 cm ilgio. Šaknys - kuokštinės. Žiedai - atviri, piramidiniai, nulinkę.",null,null,null,null,null,null,null,null,null,"Rekomenduojamas sėjos laikotarpis: birželis - rugpjūtis"]
[null,null,null,null,null,null,null,null,null,null,null,null,null,"Aukštis: 80 - 150 cm"]
[null,null,null,null,null,null,null,null,null,null,null,null,null,"Sėjos gylis: 2 - 3 cm"]
[null,null,null,null,null,null,null,null,null,null,null,null,null,"Sėjos norma: 100 - 120 kg/ha"]
[null,null,null,null,null,null,null,null,null,null,null,null,null,"Atsparumas šalčiui: ne"]
[]
[]
[null,null,null,"Auginimas. Augalas geriausiai auga vėsiose, drėgnose vietose, vidutiniškai derlingose dirvose. Gali augti visuose dirvožemiuose, toleruoja pH nuo 5 iki 6,5. Karštos, sausos oro sąlygos gali pažeisti augalą. Jautrios herbicidų pertekliui. Privalumai: greitai auga, sulaiko perteklinį azotą, teigiamai veikia dirvožemio struktūrą, didina organinės anglies kiekį, gerai stelbia piktžoles, turi alelopatinių savybių, javų sėjomainose mažina stiebo ir pašaknio ligų plitimą. Trūkumai: neatsparios vainikuotosiomis rūdimis, pritraukia amarus."]
[]
[]
[]
[]
[]
[]
[null,"GRIKIAI (Fagopyrum esculentum Moench)"]
[]
[null,null,null,"Vienmetis augalas. Stiebas - žalias su raudonu atspalviu, su tarpubambliais, tuščiaviduris, vertikalus, plačiai lapuotas, sultingas, lygus neskaitant bamblių. Lapai - skirtingo dydžio, išdėstymo ir formos, 1.7 – 6.5 cm ilgio. Šaknys – kuokštinė, paviršinės. Žiedai - ryškiai arba šiek tiek rožiniai, labai retai raudoni arba balti, be žiedlapių, auga kekėmis. Sėklos - iš trijų dalių, 0.5 – 0.7 cm ilgio, lygios, rudos, pilkos arba juodos.",null,null,null,null,null,null,null,null,null,"Rekomenduojamas sėjos laikotarpis: birželis - liepa"]
[null,null,null,null,null,null,null,null,null,null,null,null,null,"Aukštis: 60 - 130 cm"]
[null,null,null,null,null,null,null,null,null,null,null,null,null,"Sėjos gylis: 3 - 5 cm"]
[null,null,null,null,null,null,null,null,null,null,null,null,null,"Sėjos norma: 40 - 70 kg/ha"]
[null,null,null,null,null,null,null,null,null,null,null,null,null,"Atsparumas šalčiui: ne (labai jautrūs)"]
[]
[]
[null,null,null,"Auginimas. Augalas geriausiai auga lengvos arba vidutinės tekstūros, gerai drenuotame,  rūgščiame dirvožemyje, kurio pH 5 - 6,5. Augimą riboja suspaustos,  drėgnos dirvos. Privalumai: įsisavina fosforą ir padaro jį prieinamą kitiems augalams, labai gerai stelbia piktžoles, turi alelopatinį poveikį, pritraukia naudingus vabzdžius, tankios šaknys gerai purena dirvožemį. Trūkumai: netoleruoja stresinių sąlygų -  suslėgtų dirvožemių, sausros, užmirkimo."]
[]
[]
[]
[]
[]
[]
[null,"FACELIJA (Phacelia tanacetifolia Benth.)"]
[]
[null,null,null,"Gali augti kaip vienmetis, dvimetis ar daugiametis augalas. Stiebas - vertikalus, trumpas, tvirtas, plaukuotas. Lapai - pailgai ovalūs, sudėtiniai, dantyti. Šaknys - plačiai kuokštinės, 75 cm ilgio. Žiedai - tankūs, 2 – 4 kekės, vamzdinės arba varpo formos, mėlynos, baltos arba geltonos spalvos. Sėklos – 0.2 – 0.3 cm ilgio, raukšlėtos, plikos.",null,null,null,null,null,null,null,null,null,"Rekomenduojamas sėjos laikotarpis: birželis - rugpjūtis"]
[null,null,null,null,null,null,null,null,null,null,null,null,null,"Aukštis: 30 - 70 cm"]
[null,null,null,null,null,null,null,null,null,null,null,null,null,"Sėjos gylis: 1-2 cm"]
[null,null,null,null,null,null,null,null,null,null,null,null,null,"Sėjos norma: 10 - 12 kg/ha"]
[null,null,null,null,null,null,null,null,null,null,null,null,null,"Atsparumas šalčiui: taip"]
[]
[]
[null,null,null,"Auginimas. Gali augti visuose dirvožemiuose, sudygsta žemoje temperatūroje, toleruoja šaltį. Tinkamas dirvožemio pH svyruoja nuo 6,1 iki 7,8. Privalumai: greitai auga, kaupia perteklinį azotą ir kalcį, pritaukia bites, didina dirvožemio organinės anglies kiekį, teigiamai veikia dirvožemio struktūrą, sėjant didesne norma gerai stelbia piktžoles. Trūkumai: gali atsisėti ir virsti piktžole."]

{"sheet":"Technikos kainos","index":5,"n_rows":30,"n_cols":2,"rows_kept":30,"cut":false,"hidden":false,"merged":[]}
["Technikos kainos"]
[]
["Sužinokite programėlės skaičiavimuose naudojamas technikos kainas ir, jei reikia, jas patikslinkite"]
[]
["Sėjos būdas","Kaina, EUR/ha"]
["Seklusis ražienų skutimas + sėklų išbarstymas",23]
["Seklusis ražienų skutimas + pakabinamoji pneumatinė javų sėjamoji",50.93]
["Seklusis ražienų skutimas + pakabinamoji pneumatinė rapsų sėjamoji",50.09]
["Seklusis ražienų skutimas + pakabinamoji pneumatinė žolių sėjamoji",51.15]
["Kombinuotoji javų sėjamoji įdirbant dirvą",35.92]
["Kombinuotoji rapsų sėjamoji įdirbant dirvą",33.97]
["Tiesioginės sėjos (ražieninė) javų sėjamoji",26.56]
["Tiesioginės sėjos (ražieninė) rapsų sėjamoji",25.34]
["Sėklų išbarstymas",1.55]
["Kitas",10]
["Panaikinimo būdas"]
["Seklusis ražienų skutimas",20.38]
["Dirvos lėkščiavimas (žemės ūkio mašinos darbinis plotis 3 m)",26.84]
["Dirvos lėkščiavimas (žemės ūkio mašinos darbinis plotis 5 m)",21.82]
["Dirvos lėkščiavimas (žemės ūkio mašinos darbinis plotis 3 m) + dirvos dirbimas pakabinamaisiais apverčiamaisiais plūgais",91.22]
["Dirvos lėkščiavimas (žemės ūkio mašinos darbinis plotis 3 m) + dirvos dirbimas prikabinamaisiais apverčiamaisiais plūgais",91.02]
["Dirvos lėkščiavimas (žemės ūkio mašinos darbinis plotis 5 m) + dirvos dirbimas pakabinamaisiais apverčiamaisiais plūgais",86.2]
["Dirvos lėkščiavimas (žemės ūkio mašinos darbinis plotis 5 m) + dirvos dirbimas prikabinamaisiais apverčiamaisiais plūgais",86]
["Dirvos volavimas + dirvos dirbimas pakabinamaisiais apverčiamaisiais plūgais",72.39]
["Dirvos volavimas + dirvos dirbimas prikabinamaisiais apverčiamaisiais plūgais",72.19]
["Nereikia atskiro panaikinimo",0]
["Dirvos dirbimas pakabinamaisiais apverčiamaisiais plūgais",64.38]
["Dirvos dirbimas prikabinamaisiais apverčiamaisiais plūgais",64.180000000000007]
["Kitas",10]
[null,"atgal į programą"]

{"sheet":"Paramos sąlygos","index":6,"n_rows":42,"n_cols":2,"rows_kept":42,"cut":false,"hidden":false,"merged":[[23,1,23,15],[24,1,24,15],[25,1,25,15],[31,1,31,15],[33,1,33,15],[26,1,26,15],[27,1,27,15],[28,1,28,15],[29,1,29,15],[30,1,30,15],[6,1,6,15],[20,1,20,15],[32,1,32,15],[14,1,14,15],[16,1,16,15],[17,1,17,15],[18,1,18,15],[19,1,19,15],[8,1,8,15],[9,1,9,15],[10,1,10,15],[11,1,11,15],[12,1,12,15],[13,1,13,15],[21,1,21,15],[22,1,22,15]]}
[null,"KPP Agrarinės aplinkosaugos ir klimato priemonės veiklos"]
[null,"\"Tarpinių pasėlių auginimas ariamojoje žemėje\" įgyvendinimo sąlygos"]
[]
[null,"Susipažinkite su paramos tarpinių pasėlių auginimui sąlygomis"]
[]
[]
[null,"Mažiausias lauko plotas, už kurį mokamos kompensacinės išmokos - 1 ha."]
[]
[null,"Vykdydami veiklą „Tarpinių pasėlių auginimas ariamojoje žemėje“, pareiškėjai ir (arba) paramos gavėjai įsipareigoja:"]
[null," - po pagrindinio derliaus nuėmimo tarpinius pasėlius rekomenduojama pasėti per savaitę, bet ne vėliau kaip iki rugsėjo 15 d.;"]
[null," - išlaikyti tarpinius pasėlius ant dirvos paviršiaus iki kovo 1 d.;"]
[null," - įterpti tarpinius augalus į dirvą prieš pagrindinės kultūros sėją;"]
[null," - neganyti gyvulių, neruošti pašaro, nešienauti ir nesmulkinti tarpinių pasėlių auginimo laikotarpiu pagal veiklą deklaruotuose plotuose;"]
[null," - nenaudoti augalų apsaugos produktų, mineralinių trąšų ir srutų tarpinių pasėlių auginimo laikotarpiu pagal veiklą deklaruotuose plotuose;"]
[null," - įskaičiuoti tarpinių pasėlių plotus, kuriuose įgyvendinama veikla „Tarpinių pasėlių auginimas ariamojoje žemėje“, vertinant pareiškėjo tinkamumą gauti paramą už žalinimo reikalavimų, nurodytų Tiesioginių išmokų administravimo bei kontrolės taisyklių V skyriuje, įgyvendinimą. Už tą patį lauką, už kurį mokama parama pagal veiklą „Tarpinių pasėlių auginimas ariamojoje žemėje“, negali būti mokama žalinimo išmoka."]
[]
[null,"Augalų, tinkamų paramai gauti pagal veiklą \"Tarpinių pasėlių auginimas ariamojoje žemėje\" sąrašas:"]
[null," - aliejiniai ridikai,"]
[null," - avižos,"]
[null," - garstyčios,"]
[null," - dobilai,"]
[null," - facelijos,"]
[null," - gausiažiedės svidrės,"]
[null," - liucerna,"]
[null," - lubinai,"]
[null," - paprastosios šunažolės,"]
[null," - paprastieji gargždeniai,"]
[null," - pupos,"]
[null," - saulėgrąža,"]
[null," - seradelės,"]
[null," - sėjamasis grikis,"]
[null," - sėjamasis vikis,"]
[null," - šakniniai ridikai,"]
[null," - vienmečiai lubinai,"]
[null," - minėtų augalų mišiniai."]
[]
[null,"Paramos dydis - 134 Eur/ha."]
[]
[null,"Daugiau informacijos:"]
[null,"https://www.nma.lt/index.php/parama/lietuvos-kaimo-pletros-20142020-m-programa/administravimo-ir-igyvendinimo-taisykles/agrarine-aplinkosauga-ir-klimatas/8730"]
[]
[null,"atgal į programą"]

{"sheet":"Data base","index":7,"n_rows":26,"n_cols":80,"rows_kept":26,"cut":false,"hidden":true,"merged":[[0,73,0,77],[1,25,1,28],[1,29,1,32],[1,33,1,36],[0,25,0,36],[0,37,0,39],[0,2,0,3],[0,4,0,6],[0,7,0,14],[0,15,0,17],[0,18,0,24]]}
[null,null,"Sėjos būdas",null,"Soils",null,null,"pH",null,null,null,null,null,null,null,"Vegetation period",null,null,"Crops in rotation",null,null,null,null,null,null,"Sowing period",null,null,null,null,null,null,null,null,null,null,null,"Seeding rate, kg/ha",null,null,null,null,"Management challenges",null,null,null,null,null,null,null,null,"Establishment costs",null,null,null,null,null,null,null,null,"Termination costs",null,null,null,null,null,null,null,null,null,null,null,"Possible RDP payment","Benefits"]
["Tarpinis augalas","Lotyniškas pavadinimas","Undersown","Post harvest","Priesmėlis","Priemolis","Molis","pH","< 4,5","4,6 - 5","5,1 - 5,5","5,6 - 6","6,1-6,5","6,6 - 7",">7","range","min","max","Kukurūzai","Javai","Rapsai","Cukriniai runkeliai","Bulvės","Intensive crops","Ankštiniai","June",null,null,null,"July",null,null,null,"August",null,null,null,"Seeding rate, kg/ha","Seeding rate (drilled), kg/ha","Seeding rate (brodcasted), kg/ha","Potential biomass, t/ha","N in the residue, kg/ha","Establishment","Hinder crops","Killing by tillage","Killing by mow","Incorporation of mature stand","Warnings/ Potential problems","Establishment guidance","Positives/ benefits","Seed cost, EUR/kg","Shallow stubble cultivation + seed broadcasting","Shallow stubble cultivation + hanged pneumatic cereal seeder","Shallow stubble cultivation + hanged pneumatic rape seeder","Shallow stubble cultivation + hanged pneumatic herb seeder","Combined cereal seeder with soil cultivation","Combined rape seeder with soil cultivation","Direct sowing (stubbly) cereal seeder","Direct sowing (stubbly) rape seeder","Seed broadcasting","Shallow stubble cultivation","Disk harrowing (working width of the machine 3 m)","Disk harrowing (working width of the machine 5 m)","Disk harrowing (working width of the machine 3 m) + reversible hanged plough","Disk harrowing (working width of the machine 3 m) + reversible trailing plough","Disk harrowing (working width of the machine 5 m) + reversible hanged plough","Disk harrowing (working width of the machine 5 m) + reversible trailing plough","Rolling + reversible hanged plough","Rolling + reversible trailing plough","No separate termination","Reversable hanged plough","Reversable trailing plough","Payment, EUR/ha","Transferring of nitrogen, kg/ha","Reduction of weed density, %","Weed reduction capacity","Suppression of diseases: biological impact","Suppression of diseases: affected main crop","Latest sowing date","Production of SOC, kg/ha"]
["Baltosios garstyčios","Sinapis alba L","No ","Yes","No","Yes","Yes"," 4,5-8,2","No","Yes","Yes","Yes","Yes","Yes","Yes","45-50",45,50,"SR","SR",null,null,null,null,"SR",null,null,null,null,"٧","٧","٧","٧","٧","٧","٧",null,12,"10-15",30,2.3000000000000003,87.4,0,2,0,3,0,"Neleiskite subrandinti sėklų. Neauginkite sėjomainose su bastutinių šeimos augalais. Labiau tinka lengvi, vandeniui laidūs dirvožemiai. Drėgnuose dirvožemiuose auga prastai. Sausose ir šiltose vietose vystymąsis gali būti greitas, dėl to kyla sumedėjimo rizika. Jautrios kenkėjams, tokiems kaip pjūklelių lervos, aruodiniai straubliukai, spragės.","Gali būti sėjamos sėklą išberiant ant paruoštos  dirvos paviršiaus, arba naudojant įprastą sėjamąją. Guoliavietės pagrindas turi būti  kietas, joje neturėtų būti piktžolių pradų. Privoluokite dirvą, kad pagerintumėte sėklų ir dirvožemio kontaktą, bet nesuardykite dirvožemio agregatų. Sėjos gylis 1-2 cm. Gali būti auginamos mišiniuose su ankštiniais (pvz. dobilais, vikiais) arba žolėmis.",null,1.78,23,null,null,null,null,33.97,null,25.34,1.55,20.38,null,null,null,null,null,null,null,null,0,null,null,134,36.459766011367734,90,"Large","Reduces number of nematodes in the soil; Has toxic effect on a range of fungal and soil borne diseases.","Potatoe, carrots, sugar beat",{"$f":"DATE((YEAR(Tool!$C$10)),8,20)","v":"2020-08-20"},200]
["Rudosios garstyčios","Brassica juncea (L.) Czern.","No ","Yes","No","No","Yes","4,3-8,3","Yes","Yes","Yes","Yes","Yes","Yes","Yes","60-70",60,70,"SR","SR",null,null,null,"SR","SR",null,"٧","٧","٧","٧","٧","٧",null,null,null,null,null,5,"5-10",20,2.3000000000000003,87.4,0,2,0,3,0,"Neleiskite garstyčioms subrandinti sėklų. Neauginkite sėjomainose su bastutinių šeimos augalais.","Gali būti sėjamos arba sėklą išberiant ant paruoštos  dirvos paviršiaus, arba naudojant įprastą sėjamąją. Guoliavietės pagrindas turi būti  kietas, joje neturėtų būti piktžolių pradų. Privoluokite dirvą, kad pagerintumėte sėklų ir dirvožemio kontaktą, bet nesuardykite dirvožemio agregatų. Sėjos gylis 1-2 cm. Gali būti auginamos mišiniuose su ankštiniais (pvz. dobilais, vikiais) arba žolėmis.",null,3.3,23,null,null,null,null,33.97,null,25.34,1.55,20.38,null,null,null,null,null,null,null,null,0,null,null,134,36.459766011367734,50,"Medium","-","-",{"$f":"DATE((YEAR(Tool!$C$10)),7,23)","v":"2020-07-23"},200]
["Vasariniai rapsai","Brassica napus L. ssp. Oleifera","No ","Yes","No","Yes","Yes"," 5,5-7,4","No","No","No","Yes","Yes","Yes","Yes","50-60",50,60,"SR","SR",null,"S","S",null,"S",null,null,null,"٧","٧","٧","٧","٧","٧","٧",null,null,10,"10-20",20,1.55,55.800000000000004,0,2,2,3,1,"Linkę užsikrėsti įvairiomis ligomis. Kad jų išvengtumėte, neauginkite sėjomainose su bastutinių šeimos augalais. Būtina gerai paruošta dirva. Dirvos suslėgimas riboja šaknijimąsi, tai gali sumažinti maisto medžiagių ir vandens įsisavinimą.","Sėkla gali būti sėjama sėjamosiomis  arba išberiama skutant ar kultivuojant dirvą po pagrindinių augalų nuėmimo. Paruoškite lygią, be piktžolių pradų sėklos guoliavietę, kurioje dygimui netrūktų drėgmės. Po sėjos privoluokite dirvą, kad pagerintumėte sėklų ir dirvožemio sąlytį. Gali būti auginami mišiniuose su ankštiniais (pvz. vikiais, žirniais, pupomis) arba žolėmis (pvz. svidrėmis).",null,1.5,23,null,null,null,null,33.97,null,25.34,1.55,20.38,null,null,null,null,null,null,null,null,0,null,null,null,21.802397665420209,80,"Large","-","-",{"$f":"DATE((YEAR(Tool!$C$10)),8,15)","v":"2020-08-15"},150]
["Žieminiai rapsai","Brassica napus L.","No ","Yes","No","Yes","Yes"," 5,5-7,4","No","No","No","Yes","Yes","Yes","Yes","50-70",50,70,"SR","SR",null,"S","S",null,"S",null,"٧","٧","٧","٧","٧","٧","٧","٧","٧",null,null,8,"8-20",20,1.55,55.800000000000004,0,2,2,3,1,"Gali platinti bastutinių šeimos augalų ligas, todėl nenaudokite sėjomainose su bastutinių šeimos augalais. Dygti gali lėtai. Jautresni dirvos suspaudimui nei javai.","Paruoškite lygią, be piktžolių pradų sėklos guoliavietę, kurioje dygimui netrūktų drėgmės. Po sėjos privoluokite dirvą, kad pagerintumėte sėklų ir dirvožemio sąlytį, bet nesuardykite dirvožemio agregatų. Gali būti auginami mišiniuose su ankštiniais (pvz. vikiais, žirniais, pupomis) arba žolėmis (pvz. svidrėmis).",null,1.5,null,null,50.09,51.15,null,33.97,null,25.34,1.55,null,null,null,91.22,91.02,86.2,86,72.39,72.19,null,64.38,64.180000000000007,null,21.802397665420209,80,"Large","-","-",{"$f":"DATE((YEAR(Tool!$C$10)),8,15)","v":"2020-08-15"},150]
["Aliejiniai ridikai","Raphanus sativus L","No ","Yes","Yes","Yes","Yes"," 6-7,4","No","No","No","No","Yes","Yes","Yes","50-65",50,65,"SR","SR",null,null,"S","S","SR",null,null,null,"٧","٧","٧","٧","٧","٧","٧",null,null,15,"10-25","Nerekomenduojama",2.95,109.15,0,0,0,1,0,"Nenaudokite sėjomainoje su bastutinių šeimos daržovėmis. Ridikai pritraukia sprages, tačiau rudens laikotarpiu kiek mažiau. Ridikai prastai toleruoja drėgnas dirvas. Jautriai reaguoja į azoto kiekį dirvožemyje. Esant azoto deficitui prastai konkuruoja su piktžolėmis.","Sėti kiek galima anksčiau. Sėjant sėjamosiomis pasėlis daug geresnis, todėl berti ant paviršiaus tikslinga tik kai dirvožemis per daug šlapias sėti sėjamąja. Po sėjos privoluokite dirvą, kad pagerintumėte sėklų ir dirvožemio sąlytį, bet nesutraiškykite dirvožemio agregatų. Gali būti auginami mišiniuose su ankštiniais.","The plant contains raphanin, which is antibacterial and antifungal, contain chemicals that help suppress nematodes e.g. cyst nematodes which attack potatoes. Forage radishes also suppress fall weeds.",1.69,null,null,50.09,51.15,null,33.97,null,25.34,null,20.38,null,null,null,null,null,null,null,null,0,null,null,134,44.125255808964546,90,"Large","Reduces number of nematodes in the soil; Has toxic effect on a range of fungal and soil borne diseases.","Potatoe, carrots, sugar beat",{"$f":"DATE((YEAR(Tool!$C$10)),8,15)","v":"2020-08-15"},250]
["Šakniniai ridikai","Raphanus sativus var.oleifer","No ","Yes","No","Yes","Yes"," 6-7,5","No","No","No","No","Yes","Yes","Yes","55-70",55,70,"SR","SR",null,null,null,null,"SR",null,null,null,null,"٧","٧","٧","٧",null,null,null,null,10,"8-12","Nerekomenduojama",2.0500000000000003,69.700000000000017,0,0,0,0,1,"Gali platinti bastutinių šeimos augalų ligas, todėl nenaudokite sėjomainose su bastutinių šeimos augalais.  Jei šaknys gerai išsivysčiusios, gali būti sudėtinga panaikinti.","Sėkla gali būti sėjama sėjamosiomis  arba išberiama skutant ar kultivuojant dirvą po pagrindinių augalų nuėmimo. Siekiant paskatinti augimą, gali būti auginami mišiniuose su ankštiniais.","The roots die over the winter and leave channels so that the soil dries and warms up faster in the spring. ",7.5,null,null,50.09,51.15,null,33.97,null,25.34,null,20.38,26.84,21.82,null,null,null,null,null,null,0,null,null,134,25.197186213409996,80,"Large","-","-",{"$f":"DATE((YEAR(Tool!$C$10)),8,1)","v":"2020-08-01"},180]
["Žieminiai rapsiukai","Brassica rapa subsp. rapa","No ","Yes","Yes","Yes","No","5,3 - 6.8","No","No","No","Yes","Yes","Yes","No","50-60",50,60,"SR","SR",null,"S","S",null,"S",null,null,"٧","٧","٧","٧","٧","٧","٧","٧",null,null,8,"5-10","Nerekomenduojama",1.65,56.099999999999994,0,2,2,3,1,"Gali platinti bastutinių šeimos augalų ligas. Nenaudokite sėjomainose su bastutinių šeimos augalais. Dygti gali lėtai.  Dirvožemio drėgmės išsaugojimas užtikrina gerą rapsiukų sudygimą.","Paruoškite lygią, be piktžolių pradų sėklos guoliavietę, kurioje dygimui netrūktų drėgmės. Po sėjos privoluokite dirvą, kad pagerintumėte sėklų ir dirvožemio sąlytį, bet nesutraiškykite dirvožemio agregatų. Galite auginti kaip pavienį tarpinį pasėlį arba mišiniuose su ankštiniais (pvz., vikiais, žirniais).","Useful for suppressing Sclerotinia in lettuce.",1.5,null,null,50.09,51.15,null,33.97,null,25.34,null,20.38,null,null,null,null,null,null,null,null,null,null,null,null,20.280662074208038,80,"Large","Suppress Sclerotinia","Lettuce",{"$f":"DATE((YEAR(Tool!$C$10)),8,15)","v":"2020-08-15"},150]
["Žieminiai rugiai","Secale cereale L","No ","Yes","Yes","Yes","No","5 - 7","No","No","Yes","Yes","Yes","Yes","No","45-50",45,50,"SR","S","S","S","S","S","S",null,null,null,"٧","٧","٧","٧","٧","٧","٧","٧",null,70,"70-90","Nerekomenduojama",1.25,37.5,1,3,1,0,4,"Yrant rugių biomasei gali būti imobilizuojamas dirvožemio azotas. Azoto imobilizavimą apsprendžia rugių subrendimo laipsnis. Rugių biomasėje sukaupto azoto mineralizacija yra labai lėta, tad neverta tikėtis, kad peržiemojusių rugių sukauptas azotas greitai bus prieinamas kitiems augalams. Augalus, kuriems yra reikalingas azotas, reikėtų sėti ne anksčiau kaip 2 savaitės po rugių įterpimo.","Paruoškite sėklos guoliavietę be grumstų ir piktžolių. Jei žemės dirbimas neįmanomas, rugiai gali būti išberiami ant drėgnos, neįdirbtos dirvos. Gali būti auginami mišiniuose su ankštiniais (pvz., žirniais, vikiais, pupomis).",null,0.5,null,50.93,null,null,35.92,null,26.56,null,null,20.38,null,null,91.22,91.02,86.2,86,72.39,72.19,null,64.38,64.180000000000007,null,11.082730279069693,75,"Large","-","-",{"$f":"DATE((YEAR(Tool!$C$10)),8,20)","v":"2020-08-20"},160]
["Baltieji dobilai","Trifolium repens L","Yes","Yes","Yes","Yes","Yes","5,6-7,0","No","No","No","Yes","Yes","Yes","No","60-80",60,80,"SR","SR","S","S",null,null,null,"٧","٧","٧","٧",null,null,null,null,null,null,null,null,9,"8-10","Nerekomenduojama",2.0500000000000003,65.600000000000023,1,3,4,2,1,"Dobilai labai jautrūs kalio ir fosforo kiekiui dirvožemyje, todėl pakankami šių maistinių medžiagų kiekiai yra būtini sėkmingam sudygimui, susiformavimui bei produktyvumui užtikrinti. Dygti gali sunkiai ir lėtai. Ankštines daržoves sodinkite tik praėjus dviems metams, nes baltieji dobilai platina šaknų puvinius, tokius kaip Pythium ir Rhizoctonia.","Naudokite įprastinį žemės dirbimą, paruoškite sėklos guoliavietę tvirtu pagrindu. Po sėjos, privoluokite dirvą, kad pagerintumėte sėklų ir dirvožemio sąlytį, bet nesunaikinkite dirvožemio agregatų. Baltieji dobilai gerai toleruoja šlapias dirvas. Gali būti auginami mišiniuose su garstyčiomis ir rugiais.",null,6,null,null,null,51.15,null,null,null,null,null,null,null,null,null,null,null,null,null,null,null,64.38,64.180000000000007,134,21.583884955556751,15,"Low","-","-",{"$f":"DATE((YEAR(Tool!$C$10)),7,1)","v":"2020-07-01"},180]
["Raudonieji dobilai","Trifolium pratense L","Yes","Yes","Yes","Yes","Yes","6,0-7,0","No","No","No","No","Yes","Yes","No","60-80",60,80,"SR","SR","S","S",null,null,null,"٧","٧","٧","٧",null,null,null,null,null,null,null,null,12,"10-15","Nerekomenduojama",2.0500000000000003,65.600000000000023,1,0,2,3,1,"Raudonieji dobilai skatina amarais mintančių vabzdžių (boružių, auksaakių lervų, žiedmusių lervų) plitimą. Platina šaknų puvinį (Aphanomyces). Pradžioje auga lėtai. Geriau auga vėsiose ir drėgnose vietose.","Pirkite didelio daigumo sėklas. Sėjant svarbu išlaikyti tvirtą sėklos guoliavietę. Po sėjos privoluokite dirvą, kad pagerintumėte sėklų ir dirvožemio sąlytį, bet nesutraiškykite dirvožemio agregatų. Galite auginti mišiniuose su avižomis, svidrėmis.",null,4.5,null,null,null,51.15,null,null,null,null,null,null,null,null,null,null,null,null,null,null,null,64.38,64.180000000000007,134,21.583884955556751,60,"Medium","-","-",{"$f":"DATE((YEAR(Tool!$C$10)),7,1)","v":"2020-07-01"},180]
["Baltažiedžiai barkūnai","Melilotus alba L","Yes","Yes","Yes","Yes","Yes","6,5 - 7,5","No","No","No","No","No","Yes","Yes","65-80",65,80,"SR","SR","S","S",null,null,null,"٧","٧","٧","٧",null,null,null,null,null,null,null,null,20,20,"Nerekomenduojama",1.95,62.400000000000006,0,2,2,1,3,"Balatąjį barkūną gali būti sudėtinga įterpti. Jis gali atsisėti, tad svarbu užtikrinti, kad nevirstų piktžole.","Kadangi barkūno sėkla yra kietalukštė, prieš sėją ją reikia skarifikuoti. Sėklą patariama apvelti nitraginu, ypatingai sėjant laukuose, kuriuose barkūnas niekada neaugo. Sėjamas anksti, į drėgną dirvą. Gali būti auginamas mišiniuose su avižomis.",null,2.8,null,null,null,51.15,null,null,null,null,null,null,null,null,null,null,null,null,null,null,null,64.38,64.180000000000007,null,20.531012518700319,60,"Medium","-","-",{"$f":"DATE((YEAR(Tool!$C$10)),7,1)","v":"2020-07-01"},180]
["Gausiažiedės svidrės","Lolium multiflorum","Yes","Yes","No","Yes","Yes","5,8-7,1","No","No","No","Yes","Yes","Yes","No","50-75",50,75,"SR","S","S","S","S","S","S",null,"٧","٧","٧",null,null,null,null,null,null,null,null,20,"20-30","Nerekomenduojama",1.4,35,0,2,0,0,2,"Venkite šiuos tarpinius pasėlius sėti esant karštam, sausam orui. Laiku neįterptos barsto sėklas ir savaime atsisėja. Svarbu imtis priemonių, kad neplistų kaip piktžolė. Po įterpimo biomasės suirimui reikia tam tikro laiko. Svidrės neatsparios vainikuotosioms ir rudosioms rūdims (Puccinia spp.). Pritraukia amarus.","Įdirbkite žemę ir ir pašalinkite visas piktžoles. Kuomet įmanoma, sėklas įterpkite. Esant pakankamai drėgmės, sėklas galima ir išbarstyti. Gali būti auginamos mišiniuose su ankštiniais (pvz., vikiais). Mišiniai su ankštiniais gali padėti išvengti dirvožemio azoto imobilizavimo biomasei yrant.","Italian ryegrass tolerates compacted soils.",1.7,null,null,null,51.15,null,null,null,null,null,20.38,null,null,null,null,null,null,null,null,null,null,64.180000000000007,134,7.7917517022105907,30,"Low","-","-",{"$f":"DATE((YEAR(Tool!$C$10)),7,1)","v":"2020-07-01"},180]
["Daugiametės svidrės","Lolium perenne L.","Yes","Yes","No","Yes","Yes","5,5-7,0","No","No","No","Yes","Yes","Yes","No","60-80",60,80,"SR","S","S","S","S","S","S",null,"٧","٧","٧",null,null,null,null,null,null,null,null,20,"20-25","Nerekomenduojama",1.4,35,0,2,0,0,2,"Daugiametės svidrės jautrios temperatūros ekstremumams. Joms netinka sausi ir šlapi dirvožemiai. Svarbu užtikrinti, kad svidrė neplistų kaip piktžolė (kad neliktų nesudygusių sėklų). Įterpta biomasė gali kuriam laikui imobilizuoti dirvožemio azotą.","Lengvai suspauskite žemę, tada tolygiai išberkite sėklas, kad būtų užtikrintas geras padengimas. Gerai suakėkite. Tvirta, be piktžolių sėklos guoliavietė užtikrina geriausius rezultatus. Gali būti auginamos mišiniuose su ankštiniais (pvz., dobilais). Mišiniai su ankštiniais gali padėti išvengti dirvožemio azoto imobilizavimo biomasei skaidantis.",null,2.36,null,null,null,51.15,null,null,null,null,null,null,null,null,null,null,null,null,null,null,null,64.38,null,null,7.7917517022105907,14,"Low","Delayes the apothecia formation of Sclerotinia sclerotiorum","Winter rape, spring rape, peas, beans",{"$f":"DATE((YEAR(Tool!$C$10)),7,1)","v":"2020-07-01"},180]
["Facelijos","Phacelia tanacetifolia Benth.","No ","Yes","Yes","Yes","Yes","6.1 - 7.8","No","No","No","No","Yes","Yes","Yes","55-70",55,70,"SR","SR","SR","S",null,null,"S",null,"٧","٧","٧","٧","٧","٧","٧","٧","٧",null,null,10,"10-12","Nerekomenduojama",2.0500000000000003,65.600000000000023,2,0,1,1,1,"Geriausiai auga derlingose, gerai sausinamose dirvose, neužpavėsintos. Reikėtų neleisti subrandinti sėklų, nes gali atsisėti.","Sėkla gali būti sėjama sėjamosiomis  arba išberiama skutant ar kultivuojant dirvą po pagrindinių augalų nuėmimo.Sėklos turi būti tolygiai paskleidžiamos ant gerai paruoštos sėklos guoliavietės. Pašalinkite piktžoles, ypač daugiametes, ir išakėkite dirvožemio paviršių. Sėkla turi atsidurti maždaug 1 cm gylyje. Facelijos gali būti auginamos mišiniuose su grikiais.",null,5,null,null,50.09,51.15,null,33.97,null,25.34,null,20.38,null,null,null,null,null,null,null,null,0,null,null,134,21.583884955556751,30,"Low","Reduces club root disease","Brassica",{"$f":"DATE((YEAR(Tool!$C$10)),8,15)","v":"2020-08-15"},180]
["Paprastosios šunažolės","Dactilis Glomerata","Yes","No","No","Yes","Yes","5,7-7,5","No","No","No","Yes","Yes","Yes","Yes","60-80",60,80,"?","?","?","?","?","?","?",null,null,null,null,"٧","٧","٧","٧",null,null,null,null,12,"12-14","Nerekomenduojama",1.8499999999999999,48.099999999999994,"?","?","?","?","?",null,"After seeding it is usefull to roll the ground to improve seed-to-soil contact but do not break up soil aggregates.",null,5.23,null,null,null,51.15,null,null,null,null,null,null,null,null,null,91.02,86.2,86,null,null,null,64.38,64.180000000000007,null,11.545270547835981,40,"Medium","-","-",{"$f":"DATE((YEAR(Tool!$C$10)),8,1)","v":"2020-08-01"},220]
["Sėjamosios ir netikšės avižos","Avena sativa L & Avena strigosa L.","No ","Yes","Yes","Yes","Yes","5,3-6,5","No","No","Yes","Yes","Yes","No","No","50-80",50,80,"SR","S","SR","SR","SR","SR","S","٧","٧","٧","٧","٧","٧","٧","٧","٧","٧",null,null,100,"100-120","Nerekomenduojama",1.8499999999999999,48.099999999999994,0,2,0,3,2,"Po stipraus lietaus susidarius plutai avižos gali žūti, todėl jas gali tekti  atsėti. Avižų šaknų sistema neparsiskverbia per suslėgtą dirvožemį. Avižos neatsparios vainikuotosioms rūdims, pritraukia amarus.","Gali būti sėjamos sėjamosiomis  arba išberiamos skutant ar kultivuojant dirvą po pagrindinių augalų nuėmimo. Įdirbkite žemę ir sunaikinkite piktžoles guoliavietėje. Po sėjos privoluokite dirvą. Gali būti auginamos mišiniuose su vikiais, žirniais, pupomis.",null,0.63,null,50.93,null,null,35.92,null,26.56,null,null,20.38,null,null,null,null,null,null,null,null,0,null,null,134,11.545270547835981,90,"Large","Reduces club root disease","Brassica",{"$f":"DATE((YEAR(Tool!$C$10)),8,15)","v":"2020-08-15"},220]
["Grikiai","Fagopyrum esculentum Moench","No ","Yes","Yes","Yes","No"," 4,5-6,5","No","Yes","Yes","Yes","Yes","No","No","60-80",60,80,"S","S","S",null,"S","S","S",null,null,null,"٧","٧","٧","٧",null,null,null,null,null,40,"40-70","Nerekomenduojama",1.8499999999999999,44.399999999999991,0,0,0,0,0,"Venkite sėti drėgnose vietose, grikiai nepakenčia užmirkimo. Nesėkite sunkiame dirvožemyje. Grikiai neįveikia armens pado. Jei tarp augalų susidarys didesni nei 60 cm tarpai, juose plis piktožolės. Grikių pasėliai privilioja ne tik naudingus vabzdžius, tačiau ir kenkėjus, pavyzdžiui amarus. Grikiai yra ypatingai jautrūs nepalankioms oro sąlygoms, žūva esant mažiausioms šalnoms.  ","Norint užtikrinti greitą pasėlių sudygimą, būtina gerai paruošti sėklos guoliavietę. Mažai derlingose dirvose grikiai augs geriau nei daugelis kitų tarpinių pasėlių. Jie sparčiai auga ir greitai užbaigia vegetacijos ciklą (po pirmųjų šalnų).",null,0.8,null,50.93,null,null,35.92,null,26.56,null,null,20.38,null,null,null,null,null,null,null,null,0,null,null,134,9.0378005621090214,90,"Large","-","-",{"$f":"DATE((YEAR(Tool!$C$10)),7,23)","v":"2020-07-23"},220]
["Žieminiai (ruginiai) vikiai","Vicia villosa Roth","No ","Yes","Yes","Yes","Yes","5 - 7,5","No","No","Yes","Yes","Yes","Yes","Yes","50-80",50,80,"SR","SR","SR","S","S","S",null,"٧","٧","٧","٧","٧","٧","٧","٧","٧",null,null,null,45,"30-50","Nerekomenduojama",1.65,74.25,2,0,3,0,2,"Vikiai prastai auga suslėgtuose dirvožemiuose. Reikalauja daug fosforo ir kalio. Jei subrandina sėklas, gali plisti kaip piktžolė. Prieš sėdami kitus ankštinius augalus palaukite bent trejus metus, nes vikiai platina šaknų puvinius, yra pažeidžiami nematodų. Gali būti miltligės šaltinis.","Paruoškite gerai nusausintą, be piktžolių ir grumstų sėklos guoliavietę. Norint užtikrinti pasėlio vientisumą, pirmenybė teikiama sėjai sėjamosiomis. Gali būti auginami mišiniuose su varpiniais javais, pvz. rugiais, avižomis.",null,1.18,null,50.93,null,null,35.92,null,26.56,null,null,20.38,null,null,null,null,null,null,null,null,null,64.38,64.180000000000007,134,36.59793083340606,30,"Low","-","-",{"$f":"DATE((YEAR(Tool!$C$10)),8,7)","v":"2020-08-07"},100]
["Sėjamieji žirniai","Pisum sativum L","No ","Yes","No","Yes","Yes","5,5-7,0","No","No","No","Yes","Yes","Yes","No","50-80",50,80,"SR","SR","SR","SR","S","S",null,"٧","٧","٧","٧","٧","٧","٧","٧","٧","٧",null,null,150,"100-250","Nerekomenduojama",1.8499999999999999,74,0,0,0,0,1,"Žirniai prastai konkuruoja su piktžolėmis.","Žirniai gali būti sėjami įprastomis javų sėjamosiomis. Paprastai sėjami 4–6 cm gyliu. Gali būti auginami mišiniuose su varpiniais augalais, pvz. rugiais, avižomis.",null,0.2,null,50.93,null,null,35.92,null,26.56,null,null,20.38,null,null,null,null,null,null,null,null,0,null,null,null,32.6497547513775,10,"Low","-","-",{"$f":"DATE((YEAR(Tool!$C$10)),8,15)","v":"2020-08-15"},100]
["Siauralapiai lubinai","Lupinus angustifolius","No ","Yes","Yes","Yes","No","4,5-6,5","Yes","Yes","Yes","Yes","Yes","No","No","75-100",75,100,"SR","SR","SR","S","S","S",null,"٧","٧","٧","٧",null,null,null,null,null,null,null,null,100,"100-150","Nerekomenduojama",2.0500000000000003,82.000000000000014,2,0,0,0,1,"Sėkloms dirvoje išbrinkti reikia daug drėgmės. Auga lėtai, blogai stelbia piktžoles.","Mažai derlingose dirvose augs geriau nei daugelis kitų tarpinių pasėlių. Kad pradėtų dygti, reikia daug vandens. Gali būti auginami mišiniuose su avižomis.",null,0.9,null,null,null,null,null,null,null,null,null,null,null,null,null,null,null,null,null,null,0,null,null,134,36.179457967742643,20,"Low","-","-",{"$f":"DATE((YEAR(Tool!$C$10)),7,1)","v":"2020-07-01"},110]
["Pupos","Vicia faba","No ","Yes","No","Yes","Yes","5,5-7,5","No","No","No","Yes","Yes","Yes","Yes","70-90",70,90,"SR","SR","SR","SR","S","S",null,"٧","٧","٧","٧","٧","٧","٧","٧","٧","٧",null,null,180,"180-220","Nerekomenduojama",1.95,87.750000000000014,1,0,0,0,1,"Ankstyvose vystymosi stadijose pupos prastai konkuruoja su piktžolėmis. Sėklos didelės, tad sudėtinga sėti ir sudaryti mišinius.","Pupos paprastai sėjamos 6-10 cm gyliu. Esant sausoms sąlygoms, rekomenduojama sėti giliau. Sėjos norma turi būti pakankamai didelė. Pasėjus, dirvą rekomenduojama privoluoti. Gali būti auginamos mišiniuose su varpiniais augalais (pvz. avižomis), kitais ankštiniais (pvz., vikiais), arba bastutiniais (pvz. rapsais).",null,0.28000000000000003,null,50.93,null,null,35.92,null,26.56,null,null,20.38,null,null,null,null,null,null,null,null,0,null,null,134,43.252100075843536,40,"Medium","-","-",{"$f":"DATE((YEAR(Tool!$C$10)),8,15)","v":"2020-08-15"},110]
[]
[null,null,null,null,null,null,null,null,null,null,null,null,null,null,null,null,null,null,"SR - strongly recommended"]
[null,null,null,null,null,null,null,null,null,null,null,null,null,null,null,null,null,null,"S - suitable"]

{"sheet":"Lists","index":8,"n_rows":22,"n_cols":38,"rows_kept":22,"cut":false,"hidden":true,"merged":[]}
["Way of catch crop growing",null,"Soil type",null,"Soil pH",null,"Establishment methods",null,null,null,null,null,null,null,null,null,null,null,null,null,null,null,null,null,null,null,null,null,"Slope of the field","Coefficient","Obstacles","Coefficient","Stones","Coefficient","Bar length","Coefficient",null,"Todays date"]
["Undersown",null,"Priesmėlis",null,"< 4,5",null,"Baltosios garstyčios","Rudosios garstyčios","Vasariniai rapsai","Žieminiai rapsai","Aliejiniai ridikai","Šakniniai ridikai","Žieminiai rapsiukai","Žieminiai rugiai","Baltieji dobilai","Raudonieji dobilai","Baltažiedžiai barkūnai","Gausiažiedės svidrės","Daugiametės svidrės","Facelijos","Paprastosios šunažolės","Sėjamosios ir netikšės avižos","Grikiai","Žieminiai (ruginiai) vikiai","Sėjamieji žirniai","Siauralapiai lubinai","Pupos",null,"1-3",0.98,"<5",0.96,"<10",0.98,">600",0.97,null,{"$f":"TODAY()","v":"2020-07-07"}]
["Post harvest",null,"Molis",null,"4,6 - 5",null,"Sėklų išbarstymas","Sėklų išbarstymas","Sėklų išbarstymas","Tiesioginės sėjos (ražieninė) rapsų sėjamoji","Tiesioginės sėjos (ražieninė) rapsų sėjamoji","Tiesioginės sėjos (ražieninė) rapsų sėjamoji","Tiesioginės sėjos (ražieninė) rapsų sėjamoji","Tiesioginės sėjos (ražieninė) javų sėjamoji","Seklusis ražienų skutimas + pakabinamoji pneumatinė žolių sėjamoji","Seklusis ražienų skutimas + pakabinamoji pneumatinė žolių sėjamoji","Seklusis ražienų skutimas + pakabinamoji pneumatinė žolių sėjamoji","Seklusis ražienų skutimas + pakabinamoji pneumatinė žolių sėjamoji","Seklusis ražienų skutimas + pakabinamoji pneumatinė žolių sėjamoji","Tiesioginės sėjos (ražieninė) rapsų sėjamoji","Seklusis ražienų skutimas + pakabinamoji pneumatinė žolių sėjamoji","Tiesioginės sėjos (ražieninė) javų sėjamoji","Tiesioginės sėjos (ražieninė) javų sėjamoji","Tiesioginės sėjos (ražieninė) javų sėjamoji","Tiesioginės sėjos (ražieninė) javų sėjamoji","Seklusis ražienų skutimas + pakabinamoji pneumatinė žolių sėjamoji","Tiesioginės sėjos (ražieninė) javų sėjamoji",null,"3-5",0.94,"5-15",0.91,"10-25",0.92,"400-600",0.92]
[null,null,"Priemolis",null,"5,1 - 5,5",null,"Tiesioginės sėjos (ražieninė) rapsų sėjamoji","Tiesioginės sėjos (ražieninė) rapsų sėjamoji","Tiesioginės sėjos (ražieninė) rapsų sėjamoji","Kombinuotoji rapsų sėjamoji įdirbant dirvą","Kombinuotoji rapsų sėjamoji įdirbant dirvą","Kombinuotoji rapsų sėjamoji įdirbant dirvą","Kombinuotoji rapsų sėjamoji įdirbant dirvą","Kombinuotoji javų sėjamoji įdirbant dirvą","Kitas","Kitas","Kitas","Kitas","Kitas","Kombinuotoji rapsų sėjamoji įdirbant dirvą","Kitas","Kombinuotoji javų sėjamoji įdirbant dirvą","Kombinuotoji javų sėjamoji įdirbant dirvą","Kombinuotoji javų sėjamoji įdirbant dirvą","Kombinuotoji javų sėjamoji įdirbant dirvą","Kitas","Kombinuotoji javų sėjamoji įdirbant dirvą",null,"5-7",0.91,"5-25",0.84,"25-50",0.9,"300-400",0.87]
["Participation in RDP",null,null,null,"5,6 - 6",null,"Kombinuotoji rapsų sėjamoji įdirbant dirvą","Kombinuotoji rapsų sėjamoji įdirbant dirvą","Kombinuotoji rapsų sėjamoji įdirbant dirvą","Seklusis ražienų skutimas + pakabinamoji pneumatinė rapsų sėjamoji","Seklusis ražienų skutimas + pakabinamoji pneumatinė rapsų sėjamoji","Seklusis ražienų skutimas + pakabinamoji pneumatinė žolių sėjamoji","Seklusis ražienų skutimas + pakabinamoji pneumatinė žolių sėjamoji","Seklusis ražienų skutimas + pakabinamoji pneumatinė javų sėjamoji",null,null,null,null,null,"Seklusis ražienų skutimas + pakabinamoji pneumatinė žolių sėjamoji",null,"Seklusis ražienų skutimas + pakabinamoji pneumatinė javų sėjamoji","Seklusis ražienų skutimas + pakabinamoji pneumatinė javų sėjamoji","Seklusis ražienų skutimas + pakabinamoji pneumatinė javų sėjamoji","Seklusis ražienų skutimas + pakabinamoji pneumatinė javų sėjamoji",null,"Seklusis ražienų skutimas + pakabinamoji pneumatinė javų sėjamoji",null,"7-9",0.84,"25-39",0.77,">50",0.85,"200-300",0.82]
["Taip",null,null,null,"6,1-6,5",null,"Seklusis ražienų skutimas + sėklų išbarstymas","Seklusis ražienų skutimas + sėklų išbarstymas","Seklusis ražienų skutimas + sėklų išbarstymas","Seklusis ražienų skutimas + pakabinamoji pneumatinė žolių sėjamoji","Seklusis ražienų skutimas + pakabinamoji pneumatinė žolių sėjamoji","Seklusis ražienų skutimas + pakabinamoji pneumatinė rapsų sėjamoji","Seklusis ražienų skutimas + pakabinamoji pneumatinė rapsų sėjamoji","Kitas",null,null,null,null,null,"Seklusis ražienų skutimas + pakabinamoji pneumatinė rapsų sėjamoji",null,"Kitas","Kitas","Kitas","Kitas",null,"Kitas",null,null,null,null,null,null,null,"<200",0.78]
["Ne",null,null,null,"6,6 - 7",null,"Kitas","Kitas","Kitas","Kitas","Kitas","Kitas","Kitas",null,null,null,null,null,null,"Kitas"]
[null,null,null,null,">7",null,null,null,null,null,null,null,null,null,null,null,null,null,null,null,null,null,null,null,null,null,null,null,"Correction coefficient",null,null,{"$f":"VLOOKUP(Tool!#REF!,Lists!AC1:AD5,2,FALSE)*VLOOKUP(Tool!#REF!,Lists!AE1:AF5,2,FALSE)*VLOOKUP(Tool!#REF!,Lists!AG1:AH5,2,FALSE)*VLOOKUP(Tool!#REF!,Lists!AI1:AJ6,2,FALSE)","v":{"$error":"#REF!"}}]
[]
[]
[null,null,null,null,null,null,"Termination methods"]
[null,null,null,null,null,null,"Baltosios garstyčios","Rudosios garstyčios","Vasariniai rapsai","Žieminiai rapsai","Aliejiniai ridikai","Šakniniai ridikai","Žieminiai rapsiukai","Žieminiai rugiai","Baltieji dobilai","Raudonieji dobilai","Baltažiedžiai barkūnai","Gausiažiedės svidrės","Daugiametės svidrės","Facelijos","Paprastosios šunažolės","Sėjamosios ir netikšės avižos","Grikiai","Žieminiai (ruginiai) vikiai","Sėjamieji žirniai","Siauralapiai lubinai","Pupos"]
[null,null,null,null,null,null,"Nereikia atskiro panaikinimo","Nereikia atskiro panaikinimo","Nereikia atskiro panaikinimo","Dirvos dirbimas pakabinamaisiais apverčiamaisiais plūgais","Nereikia atskiro panaikinimo","Nereikia atskiro panaikinimo","Seklusis ražienų skutimas","Seklusis ražienų skutimas","Dirvos dirbimas pakabinamaisiais apverčiamaisiais plūgais","Dirvos dirbimas pakabinamaisiais apverčiamaisiais plūgais","Dirvos dirbimas pakabinamaisiais apverčiamaisiais plūgais","Seklusis ražienų skutimas","Dirvos dirbimas pakabinamaisiais apverčiamaisiais plūgais","Nereikia atskiro panaikinimo","Dirvos dirbimas pakabinamaisiais apverčiamaisiais plūgais","Nereikia atskiro panaikinimo","Nereikia atskiro panaikinimo","Seklusis ražienų skutimas","Nereikia atskiro panaikinimo","Nereikia atskiro panaikinimo","Nereikia atskiro panaikinimo"]
[null,null,null,null,null,null,"Seklusis ražienų skutimas","Seklusis ražienų skutimas","Seklusis ražienų skutimas","Dirvos dirbimas prikabinamaisiais apverčiamaisiais plūgais","Seklusis ražienų skutimas","Seklusis ražienų skutimas","Kitas","Dirvos lėkščiavimas (žemės ūkio mašinos darbinis plotis 3 m) + dirvos dirbimas pakabinamaisiais apverčiamaisiais plūgais","Dirvos dirbimas prikabinamaisiais apverčiamaisiais plūgais","Dirvos dirbimas prikabinamaisiais apverčiamaisiais plūgais","Dirvos dirbimas prikabinamaisiais apverčiamaisiais plūgais","Dirvos dirbimas prikabinamaisiais apverčiamaisiais plūgais","Kitas","Seklusis ražienų skutimas","Dirvos dirbimas prikabinamaisiais apverčiamaisiais plūgais","Seklusis ražienų skutimas","Seklusis ražienų skutimas","Dirvos dirbimas pakabinamaisiais apverčiamaisiais plūgais","Seklusis ražienų skutimas","Kitas","Seklusis ražienų skutimas"]
[null,null,null,null,null,null,"Kitas","Kitas","Kitas","Dirvos lėkščiavimas (žemės ūkio mašinos darbinis plotis 3 m) + dirvos dirbimas pakabinamaisiais apverčiamaisiais plūgais","Kitas","Dirvos lėkščiavimas (žemės ūkio mašinos darbinis plotis 3 m)",null,"Dirvos lėkščiavimas (žemės ūkio mašinos darbinis plotis 3 m) + dirvos dirbimas prikabinamaisiais apverčiamaisiais plūgais","Kitas","Kitas","Kitas","Kitas",null,"Kitas","Dirvos lėkščiavimas (žemės ūkio mašinos darbinis plotis 3 m) + dirvos dirbimas prikabinamaisiais apverčiamaisiais plūgais","Kitas","Kitas","Dirvos dirbimas prikabinamaisiais apverčiamaisiais plūgais","Kitas",null,"Kitas"]
[null,null,null,null,null,null,null,null,null,"Dirvos lėkščiavimas (žemės ūkio mašinos darbinis plotis 3 m) + dirvos dirbimas prikabinamaisiais apverčiamaisiais plūgais",null,"Dirvos lėkščiavimas (žemės ūkio mašinos darbinis plotis 5 m)",null,"Dirvos lėkščiavimas (žemės ūkio mašinos darbinis plotis 5 m) + dirvos dirbimas pakabinamaisiais apverčiamaisiais plūgais",null,null,null,null,null,null,"Dirvos lėkščiavimas (žemės ūkio mašinos darbinis plotis 5 m) + dirvos dirbimas pakabinamaisiais apverčiamaisiais plūgais",null,null,"Kitas"]
[null,null,null,null,null,null,null,null,null,"Dirvos lėkščiavimas (žemės ūkio mašinos darbinis plotis 5 m) + dirvos dirbimas pakabinamaisiais apverčiamaisiais plūgais",null,"Kitas",null,"Dirvos lėkščiavimas (žemės ūkio mašinos darbinis plotis 5 m) + dirvos dirbimas prikabinamaisiais apverčiamaisiais plūgais",null,null,null,null,null,null,"Dirvos lėkščiavimas (žemės ūkio mašinos darbinis plotis 5 m) + dirvos dirbimas prikabinamaisiais apverčiamaisiais plūgais"]
[null,null,null,null,null,null,null,null,null,"Dirvos lėkščiavimas (žemės ūkio mašinos darbinis plotis 5 m) + dirvos dirbimas prikabinamaisiais apverčiamaisiais plūgais",null,null,null,"Dirvos volavimas + dirvos dirbimas pakabinamaisiais apverčiamaisiais plūgais",null,null,null,null,null,null,"Kitas"]
[null,null,null,null,null,null,null,null,null,"Dirvos volavimas + dirvos dirbimas pakabinamaisiais apverčiamaisiais plūgais",null,null,null,"Dirvos volavimas + dirvos dirbimas prikabinamaisiais apverčiamaisiais plūgais"]
[null,null,null,null,null,null,null,null,null,"Dirvos volavimas + dirvos dirbimas prikabinamaisiais apverčiamaisiais plūgais",null,null,null,"Dirvos dirbimas pakabinamaisiais apverčiamaisiais plūgais"]
[null,null,null,null,null,null,null,null,null,"Kitas",null,null,null,"Dirvos dirbimas prikabinamaisiais apverčiamaisiais plūgais"]
[null,null,null,null,null,null,null,null,null,null,null,null,null,"Kitas"]

{"sheet":"Niche for catch crops","index":9,"n_rows":202,"n_cols":8,"rows_kept":202,"cut":false,"hidden":true,"merged":[]}
[]
["Harvest date",{"$f":"Tool!C10","v":"2020-08-05"},null,"Date","Pagrindinio pasėlio augimo laikotarpis","Niša tarpiniams posėliniams pasėliams","Niche for post harvest catch crops - too short","Vėliausia rekomendauojama tarpinių pasėlių sėjos data"]
["Sowing date",{"$f":"Tool!C12","v":"2021-04-15"},null,{"$f":"B2-10","v":"2020-07-26"},{"$f":"IF((OR(D3<$B$2, D3>$B$3)),1,0)","v":1},{"$f":"IF($B$3-$B$2>60,1-E3,0)","v":0},{"$f":"IF($B$3-$B$2<60,1-E3,0)","v":0},{"$f":"IF(Tool!$C$12-DATE((YEAR(Tool!$C$10)),8,20)<50,IF('Niche for catch crops'!D3=Tool!$C$12-50,1,\"\"),IF(D3=DATE(YEAR(Tool!$C$10),8,20),1,\"\"))","v":""}]
[null,null,null,{"$f":"D3+1","v":"2020-07-27"},1,{"$f":"IF($B$3-$B$2>60,1-E4,0)","v":0},{"$f":"IF($B$3-$B$2<60,1-E4,0)","v":0},{"$f":"IF(Tool!$C$12-DATE((YEAR(Tool!$C$10)),8,20)<50,IF('Niche for catch crops'!D4=Tool!$C$12-50,1,\"\"),IF(D4=DATE(YEAR(Tool!$C$10),8,20),1,\"\"))","v":""}]
[null,null,null,{"$f":"D4+1","v":"2020-07-28"},1,0,0,{"$f":"IF(Tool!$C$12-DATE((YEAR(Tool!$C$10)),8,20)<50,IF('Niche for catch crops'!D5=Tool!$C$12-50,1,\"\"),IF(D5=DATE(YEAR(Tool!$C$10),8,20),1,\"\"))","v":""}]
[null,null,null,"2020-07-29",1,0,0,{"$f":"IF(Tool!$C$12-DATE((YEAR(Tool!$C$10)),8,20)<50,IF('Niche for catch crops'!D6=Tool!$C$12-50,1,\"\"),IF(D6=DATE(YEAR(Tool!$C$10),8,20),1,\"\"))","v":""}]
[null,null,null,"2020-07-30",1,0,0,{"$f":"IF(Tool!$C$12-DATE((YEAR(Tool!$C$10)),8,20)<50,IF('Niche for catch crops'!D7=Tool!$C$12-50,1,\"\"),IF(D7=DATE(YEAR(Tool!$C$10),8,20),1,\"\"))","v":""}]
[null,null,null,"2020-07-31",1,0,0,{"$f":"IF(Tool!$C$12-DATE((YEAR(Tool!$C$10)),8,20)<50,IF('Niche for catch crops'!D8=Tool!$C$12-50,1,\"\"),IF(D8=DATE(YEAR(Tool!$C$10),8,20),1,\"\"))","v":""}]
[null,null,null,"2020-08-01",1,0,0,{"$f":"IF(Tool!$C$12-DATE((YEAR(Tool!$C$10)),8,20)<50,IF('Niche for catch crops'!D9=Tool!$C$12-50,1,\"\"),IF(D9=DATE(YEAR(Tool!$C$10),8,20),1,\"\"))","v":""}]
[null,null,null,"2020-08-02",1,0,0,{"$f":"IF(Tool!$C$12-DATE((YEAR(Tool!$C$10)),8,20)<50,IF('Niche for catch crops'!D10=Tool!$C$12-50,1,\"\"),IF(D10=DATE(YEAR(Tool!$C$10),8,20),1,\"\"))","v":""}]
[null,null,null,"2020-08-03",1,0,0,{"$f":"IF(Tool!$C$12-DATE((YEAR(Tool!$C$10)),8,20)<50,IF('Niche for catch crops'!D11=Tool!$C$12-50,1,\"\"),IF(D11=DATE(YEAR(Tool!$C$10),8,20),1,\"\"))","v":""}]
[null,null,null,"2020-08-04",1,0,0,{"$f":"IF(Tool!$C$12-DATE((YEAR(Tool!$C$10)),8,20)<50,IF('Niche for catch crops'!D12=Tool!$C$12-50,1,\"\"),IF(D12=DATE(YEAR(Tool!$C$10),8,20),1,\"\"))","v":""}]
[null,null,null,"2020-08-05",0,1,0,{"$f":"IF(Tool!$C$12-DATE((YEAR(Tool!$C$10)),8,20)<50,IF('Niche for catch crops'!D13=Tool!$C$12-50,1,\"\"),IF(D13=DATE(YEAR(Tool!$C$10),8,20),1,\"\"))","v":""}]
[null,null,null,"2020-08-06",0,1,0,{"$f":"IF(Tool!$C$12-DATE((YEAR(Tool!$C$10)),8,20)<50,IF('Niche for catch crops'!D14=Tool!$C$12-50,1,\"\"),IF(D14=DATE(YEAR(Tool!$C$10),8,20),1,\"\"))","v":""}]
[null,null,null,"2020-08-07",0,1,0,{"$f":"IF(Tool!$C$12-DATE((YEAR(Tool!$C$10)),8,20)<50,IF('Niche for catch crops'!D15=Tool!$C$12-50,1,\"\"),IF(D15=DATE(YEAR(Tool!$C$10),8,20),1,\"\"))","v":""}]
[null,null,null,"2020-08-08",0,1,0,{"$f":"IF(Tool!$C$12-DATE((YEAR(Tool!$C$10)),8,20)<50,IF('Niche for catch crops'!D16=Tool!$C$12-50,1,\"\"),IF(D16=DATE(YEAR(Tool!$C$10),8,20),1,\"\"))","v":""}]
[null,null,null,"2020-08-09",0,1,0,{"$f":"IF(Tool!$C$12-DATE((YEAR(Tool!$C$10)),8,20)<50,IF('Niche for catch crops'!D17=Tool!$C$12-50,1,\"\"),IF(D17=DATE(YEAR(Tool!$C$10),8,20),1,\"\"))","v":""}]
[null,null,null,"2020-08-10",0,1,0,{"$f":"IF(Tool!$C$12-DATE((YEAR(Tool!$C$10)),8,20)<50,IF('Niche for catch crops'!D18=Tool!$C$12-50,1,\"\"),IF(D18=DATE(YEAR(Tool!$C$10),8,20),1,\"\"))","v":""}]
[null,null,null,"2020-08-11",0,1,0,{"$f":"IF(Tool!$C$12-DATE((YEAR(Tool!$C$10)),8,20)<50,IF('Niche for catch crops'!D19=Tool!$C$12-50,1,\"\"),IF(D19=DATE(YEAR(Tool!$C$10),8,20),1,\"\"))","v":""}]
[null,null,null,"2020-08-12",0,1,0,{"$f":"IF(Tool!$C$12-DATE((YEAR(Tool!$C$10)),8,20)<50,IF('Niche for catch crops'!D20=Tool!$C$12-50,1,\"\"),IF(D20=DATE(YEAR(Tool!$C$10),8,20),1,\"\"))","v":""}]
[null,null,null,"2020-08-13",0,1,0,{"$f":"IF(Tool!$C$12-DATE((YEAR(Tool!$C$10)),8,20)<50,IF('Niche for catch crops'!D21=Tool!$C$12-50,1,\"\"),IF(D21=DATE(YEAR(Tool!$C$10),8,20),1,\"\"))","v":""}]
[null,null,null,"2020-08-14",0,1,0,{"$f":"IF(Tool!$C$12-DATE((YEAR(Tool!$C$10)),8,20)<50,IF('Niche for catch crops'!D22=Tool!$C$12-50,1,\"\"),IF(D22=DATE(YEAR(Tool!$C$10),8,20),1,\"\"))","v":""}]
[null,null,null,"2020-08-15",0,1,0,{"$f":"IF(Tool!$C$12-DATE((YEAR(Tool!$C$10)),8,20)<50,IF('Niche for catch crops'!D23=Tool!$C$12-50,1,\"\"),IF(D23=DATE(YEAR(Tool!$C$10),8,20),1,\"\"))","v":""}]
[null,null,null,"2020-08-16",0,1,0,{"$f":"IF(Tool!$C$12-DATE((YEAR(Tool!$C$10)),8,20)<50,IF('Niche for catch crops'!D24=Tool!$C$12-50,1,\"\"),IF(D24=DATE(YEAR(Tool!$C$10),8,20),1,\"\"))","v":""}]
[null,null,null,"2020-08-17",0,1,0,{"$f":"IF(Tool!$C$12-DATE((YEAR(Tool!$C$10)),8,20)<50,IF('Niche for catch crops'!D25=Tool!$C$12-50,1,\"\"),IF(D25=DATE(YEAR(Tool!$C$10),8,20),1,\"\"))","v":""}]
[null,null,null,"2020-08-18",0,1,0,{"$f":"IF(Tool!$C$12-DATE((YEAR(Tool!$C$10)),8,20)<50,IF('Niche for catch crops'!D26=Tool!$C$12-50,1,\"\"),IF(D26=DATE(YEAR(Tool!$C$10),8,20),1,\"\"))","v":""}]
[null,null,null,"2020-08-19",0,1,0,{"$f":"IF(Tool!$C$12-DATE((YEAR(Tool!$C$10)),8,20)<50,IF('Niche for catch crops'!D27=Tool!$C$12-50,1,\"\"),IF(D27=DATE(YEAR(Tool!$C$10),8,20),1,\"\"))","v":""}]
[null,null,null,"2020-08-20",0,1,0,{"$f":"IF(Tool!$C$12-DATE((YEAR(Tool!$C$10)),8,20)<50,IF('Niche for catch crops'!D28=Tool!$C$12-50,1,\"\"),IF(D28=DATE(YEAR(Tool!$C$10),8,20),1,\"\"))","v":1}]
[null,null,null,"2020-08-21",0,1,0,{"$f":"IF(Tool!$C$12-DATE((YEAR(Tool!$C$10)),8,20)<50,IF('Niche for catch crops'!D29=Tool!$C$12-50,1,\"\"),IF(D29=DATE(YEAR(Tool!$C$10),8,20),1,\"\"))","v":""}]
[null,null,null,"2020-08-22",0,1,0,{"$f":"IF(Tool!$C$12-DATE((YEAR(Tool!$C$10)),8,20)<50,IF('Niche for catch crops'!D30=Tool!$C$12-50,1,\"\"),IF(D30=DATE(YEAR(Tool!$C$10),8,20),1,\"\"))","v":""}]
[null,null,null,"2020-08-23",0,1,0,{"$f":"IF(Tool!$C$12-DATE((YEAR(Tool!$C$10)),8,20)<50,IF('Niche for catch crops'!D31=Tool!$C$12-50,1,\"\"),IF(D31=DATE(YEAR(Tool!$C$10),8,20),1,\"\"))","v":""}]
[null,null,null,"2020-08-24",0,1,0,{"$f":"IF(Tool!$C$12-DATE((YEAR(Tool!$C$10)),8,20)<50,IF('Niche for catch crops'!D32=Tool!$C$12-50,1,\"\"),IF(D32=DATE(YEAR(Tool!$C$10),8,20),1,\"\"))","v":""}]
[null,null,null,"2020-08-25",0,1,0,{"$f":"IF(Tool!$C$12-DATE((YEAR(Tool!$C$10)),8,20)<50,IF('Niche for catch crops'!D33=Tool!$C$12-50,1,\"\"),IF(D33=DATE(YEAR(Tool!$C$10),8,20),1,\"\"))","v":""}]
[null,null,null,"2020-08-26",0,1,0,{"$f":"IF(Tool!$C$12-DATE((YEAR(Tool!$C$10)),8,20)<50,IF('Niche for catch crops'!D34=Tool!$C$12-50,1,\"\"),IF(D34=DATE(YEAR(Tool!$C$10),8,20),1,\"\"))","v":""}]
[null,null,null,"2020-08-27",{"$f":"IF((OR(D35<$B$2, D35>$B$3)),1,0)","v":0},1,0,{"$f":"IF(Tool!$C$12-DATE((YEAR(Tool!$C$10)),8,20)<50,IF('Niche for catch crops'!D35=Tool!$C$12-50,1,\"\"),IF(D35=DATE(YEAR(Tool!$C$10),8,20),1,\"\"))","v":""}]
[null,null,null,"2020-08-28",0,1,0,{"$f":"IF(Tool!$C$12-DATE((YEAR(Tool!$C$10)),8,20)<50,IF('Niche for catch crops'!D36=Tool!$C$12-50,1,\"\"),IF(D36=DATE(YEAR(Tool!$C$10),8,20),1,\"\"))","v":""}]
[null,null,null,"2020-08-29",0,1,0,{"$f":"IF(Tool!$C$12-DATE((YEAR(Tool!$C$10)),8,20)<50,IF('Niche for catch crops'!D37=Tool!$C$12-50,1,\"\"),IF(D37=DATE(YEAR(Tool!$C$10),8,20),1,\"\"))","v":""}]
[null,null,null,"2020-08-30",0,1,0,{"$f":"IF(Tool!$C$12-DATE((YEAR(Tool!$C$10)),8,20)<50,IF('Niche for catch crops'!D38=Tool!$C$12-50,1,\"\"),IF(D38=DATE(YEAR(Tool!$C$10),8,20),1,\"\"))","v":""}]
[null,null,null,"2020-08-31",0,1,0,{"$f":"IF(Tool!$C$12-DATE((YEAR(Tool!$C$10)),8,20)<50,IF('Niche for catch crops'!D39=Tool!$C$12-50,1,\"\"),IF(D39=DATE(YEAR(Tool!$C$10),8,20),1,\"\"))","v":""}]
[null,null,null,"2020-09-01",0,1,0,{"$f":"IF(Tool!$C$12-DATE((YEAR(Tool!$C$10)),8,20)<50,IF('Niche for catch crops'!D40=Tool!$C$12-50,1,\"\"),IF(D40=DATE(YEAR(Tool!$C$10),8,20),1,\"\"))","v":""}]
[null,null,null,"2020-09-02",0,1,0,{"$f":"IF(Tool!$C$12-DATE((YEAR(Tool!$C$10)),8,20)<50,IF('Niche for catch crops'!D41=Tool!$C$12-50,1,\"\"),IF(D41=DATE(YEAR(Tool!$C$10),8,20),1,\"\"))","v":""}]
[null,null,null,"2020-09-03",0,1,0,{"$f":"IF(Tool!$C$12-DATE((YEAR(Tool!$C$10)),8,20)<50,IF('Niche for catch crops'!D42=Tool!$C$12-50,1,\"\"),IF(D42=DATE(YEAR(Tool!$C$10),8,20),1,\"\"))","v":""}]
[null,null,null,"2020-09-04",0,1,0,{"$f":"IF(Tool!$C$12-DATE((YEAR(Tool!$C$10)),8,20)<50,IF('Niche for catch crops'!D43=Tool!$C$12-50,1,\"\"),IF(D43=DATE(YEAR(Tool!$C$10),8,20),1,\"\"))","v":""}]
[null,null,null,"2020-09-05",0,1,0,{"$f":"IF(Tool!$C$12-DATE((YEAR(Tool!$C$10)),8,20)<50,IF('Niche for catch crops'!D44=Tool!$C$12-50,1,\"\"),IF(D44=DATE(YEAR(Tool!$C$10),8,20),1,\"\"))","v":""}]
[null,null,null,"2020-09-06",0,1,0,{"$f":"IF(Tool!$C$12-DATE((YEAR(Tool!$C$10)),8,20)<50,IF('Niche for catch crops'!D45=Tool!$C$12-50,1,\"\"),IF(D45=DATE(YEAR(Tool!$C$10),8,20),1,\"\"))","v":""}]
[null,null,null,"2020-09-07",0,1,0,{"$f":"IF(Tool!$C$12-DATE((YEAR(Tool!$C$10)),8,20)<50,IF('Niche for catch crops'!D46=Tool!$C$12-50,1,\"\"),IF(D46=DATE(YEAR(Tool!$C$10),8,20),1,\"\"))","v":""}]
[null,null,null,"2020-09-08",0,1,0,{"$f":"IF(Tool!$C$12-DATE((YEAR(Tool!$C$10)),8,20)<50,IF('Niche for catch crops'!D47=Tool!$C$12-50,1,\"\"),IF(D47=DATE(YEAR(Tool!$C$10),8,20),1,\"\"))","v":""}]
[null,null,null,"2020-09-09",0,1,0,{"$f":"IF(Tool!$C$12-DATE((YEAR(Tool!$C$10)),8,20)<50,IF('Niche for catch crops'!D48=Tool!$C$12-50,1,\"\"),IF(D48=DATE(YEAR(Tool!$C$10),8,20),1,\"\"))","v":""}]
[null,null,null,"2020-09-10",0,1,null,{"$f":"IF(Tool!$C$12-DATE((YEAR(Tool!$C$10)),8,20)<50,IF('Niche for catch crops'!D49=Tool!$C$12-50,1,\"\"),IF(D49=DATE(YEAR(Tool!$C$10),8,20),1,\"\"))","v":""}]
[null,null,null,"2020-09-11",0,1,0,{"$f":"IF(Tool!$C$12-DATE((YEAR(Tool!$C$10)),8,20)<50,IF('Niche for catch crops'!D50=Tool!$C$12-50,1,\"\"),IF(D50=DATE(YEAR(Tool!$C$10),8,20),1,\"\"))","v":""}]
[null,null,null,"2020-09-12",0,1,0,{"$f":"IF(Tool!$C$12-DATE((YEAR(Tool!$C$10)),8,20)<50,IF('Niche for catch crops'!D51=Tool!$C$12-50,1,\"\"),IF(D51=DATE(YEAR(Tool!$C$10),8,20),1,\"\"))","v":""}]
[null,null,null,"2020-09-13",0,1,0,{"$f":"IF(Tool!$C$12-DATE((YEAR(Tool!$C$10)),8,20)<50,IF('Niche for catch crops'!D52=Tool!$C$12-50,1,\"\"),IF(D52=DATE(YEAR(Tool!$C$10),8,20),1,\"\"))","v":""}]
[null,null,null,"2020-09-14",0,1,0,{"$f":"IF(Tool!$C$12-DATE((YEAR(Tool!$C$10)),8,20)<50,IF('Niche for catch crops'!D53=Tool!$C$12-50,1,\"\"),IF(D53=DATE(YEAR(Tool!$C$10),8,20),1,\"\"))","v":""}]
[null,null,null,"2020-09-15",0,1,0,{"$f":"IF(Tool!$C$12-DATE((YEAR(Tool!$C$10)),8,20)<50,IF('Niche for catch crops'!D54=Tool!$C$12-50,1,\"\"),IF(D54=DATE(YEAR(Tool!$C$10),8,20),1,\"\"))","v":""}]
[null,null,null,"2020-09-16",0,1,0,{"$f":"IF(Tool!$C$12-DATE((YEAR(Tool!$C$10)),8,20)<50,IF('Niche for catch crops'!D55=Tool!$C$12-50,1,\"\"),IF(D55=DATE(YEAR(Tool!$C$10),8,20),1,\"\"))","v":""}]
[null,null,null,"2020-09-17",0,1,0,{"$f":"IF(Tool!$C$12-DATE((YEAR(Tool!$C$10)),8,20)<50,IF('Niche for catch crops'!D56=Tool!$C$12-50,1,\"\"),IF(D56=DATE(YEAR(Tool!$C$10),8,20),1,\"\"))","v":""}]
[null,null,null,"2020-09-18",0,1,0,{"$f":"IF(Tool!$C$12-DATE((YEAR(Tool!$C$10)),8,20)<50,IF('Niche for catch crops'!D57=Tool!$C$12-50,1,\"\"),IF(D57=DATE(YEAR(Tool!$C$10),8,20),1,\"\"))","v":""}]
[null,null,null,"2020-09-19",0,1,0,{"$f":"IF(Tool!$C$12-DATE((YEAR(Tool!$C$10)),8,20)<50,IF('Niche for catch crops'!D58=Tool!$C$12-50,1,\"\"),IF(D58=DATE(YEAR(Tool!$C$10),8,20),1,\"\"))","v":""}]
[null,null,null,"2020-09-20",0,1,0,{"$f":"IF(Tool!$C$12-DATE((YEAR(Tool!$C$10)),8,20)<50,IF('Niche for catch crops'!D59=Tool!$C$12-50,1,\"\"),IF(D59=DATE(YEAR(Tool!$C$10),8,20),1,\"\"))","v":""}]
[null,null,null,"2020-09-21",0,1,0,{"$f":"IF(Tool!$C$12-DATE((YEAR(Tool!$C$10)),8,20)<50,IF('Niche for catch crops'!D60=Tool!$C$12-50,1,\"\"),IF(D60=DATE(YEAR(Tool!$C$10),8,20),1,\"\"))","v":""}]
[null,null,null,"2020-09-22",0,1,0,{"$f":"IF(Tool!$C$12-DATE((YEAR(Tool!$C$10)),8,20)<50,IF('Niche for catch crops'!D61=Tool!$C$12-50,1,\"\"),IF(D61=DATE(YEAR(Tool!$C$10),8,20),1,\"\"))","v":""}]
[null,null,null,"2020-09-23",0,1,0,{"$f":"IF(Tool!$C$12-DATE((YEAR(Tool!$C$10)),8,20)<50,IF('Niche for catch crops'!D62=Tool!$C$12-50,1,\"\"),IF(D62=DATE(YEAR(Tool!$C$10),8,20),1,\"\"))","v":""}]
[null,null,null,"2020-09-24",0,1,0,{"$f":"IF(Tool!$C$12-DATE((YEAR(Tool!$C$10)),8,20)<50,IF('Niche for catch crops'!D63=Tool!$C$12-50,1,\"\"),IF(D63=DATE(YEAR(Tool!$C$10),8,20),1,\"\"))","v":""}]
[null,null,null,"2020-09-25",0,1,0,{"$f":"IF(Tool!$C$12-DATE((YEAR(Tool!$C$10)),8,20)<50,IF('Niche for catch crops'!D64=Tool!$C$12-50,1,\"\"),IF(D64=DATE(YEAR(Tool!$C$10),8,20),1,\"\"))","v":""}]
[null,null,null,"2020-09-26",0,1,0,{"$f":"IF(Tool!$C$12-DATE((YEAR(Tool!$C$10)),8,20)<50,IF('Niche for catch crops'!D65=Tool!$C$12-50,1,\"\"),IF(D65=DATE(YEAR(Tool!$C$10),8,20),1,\"\"))","v":""}]
[null,null,null,"2020-09-27",0,1,0,{"$f":"IF(Tool!$C$12-DATE((YEAR(Tool!$C$10)),8,20)<50,IF('Niche for catch crops'!D66=Tool!$C$12-50,1,\"\"),IF(D66=DATE(YEAR(Tool!$C$10),8,20),1,\"\"))","v":""}]
[null,null,null,"2020-09-28",{"$f":"IF((OR(D67<$B$2, D67>$B$3)),1,0)","v":0},1,0,{"$f":"IF(Tool!$C$12-DATE((YEAR(Tool!$C$10)),8,20)<50,IF('Niche for catch crops'!D67=Tool!$C$12-50,1,\"\"),IF(D67=DATE(YEAR(Tool!$C$10),8,20),1,\"\"))","v":""}]
[null,null,null,"2020-09-29",0,{"$f":"IF($B$3-$B$2>60,1-E68,0)","v":1},{"$f":"IF($B$3-$B$2<60,1-E68,0)","v":0},{"$f":"IF(Tool!$C$12-DATE((YEAR(Tool!$C$10)),8,20)<50,IF('Niche for catch crops'!D68=Tool!$C$12-50,1,\"\"),IF(D68=DATE(YEAR(Tool!$C$10),8,20),1,\"\"))","v":""}]
[null,null,null,{"$f":"D68+1","v":"2020-09-30"},0,1,0,{"$f":"IF(Tool!$C$12-DATE((YEAR(Tool!$C$10)),8,20)<50,IF('Niche for catch crops'!D69=Tool!$C$12-50,1,\"\"),IF(D69=DATE(YEAR(Tool!$C$10),8,20),1,\"\"))","v":""}]
[null,null,null,"2020-10-01",0,1,0,{"$f":"IF(Tool!$C$12-DATE((YEAR(Tool!$C$10)),8,20)<50,IF('Niche for catch crops'!D70=Tool!$C$12-50,1,\"\"),IF(D70=DATE(YEAR(Tool!$C$10),8,20),1,\"\"))","v":""}]
[null,null,null,"2020-10-02",0,1,0,{"$f":"IF(Tool!$C$12-DATE((YEAR(Tool!$C$10)),8,20)<50,IF('Niche for catch crops'!D71=Tool!$C$12-50,1,\"\"),IF(D71=DATE(YEAR(Tool!$C$10),8,20),1,\"\"))","v":""}]
[null,null,null,"2020-10-03",0,1,0,{"$f":"IF(Tool!$C$12-DATE((YEAR(Tool!$C$10)),8,20)<50,IF('Niche for catch crops'!D72=Tool!$C$12-50,1,\"\"),IF(D72=DATE(YEAR(Tool!$C$10),8,20),1,\"\"))","v":""}]
[null,null,null,"2020-10-04",0,1,0,{"$f":"IF(Tool!$C$12-DATE((YEAR(Tool!$C$10)),8,20)<50,IF('Niche for catch crops'!D73=Tool!$C$12-50,1,\"\"),IF(D73=DATE(YEAR(Tool!$C$10),8,20),1,\"\"))","v":""}]
[null,null,null,"2020-10-05",0,1,0,{"$f":"IF(Tool!$C$12-DATE((YEAR(Tool!$C$10)),8,20)<50,IF('Niche for catch crops'!D74=Tool!$C$12-50,1,\"\"),IF(D74=DATE(YEAR(Tool!$C$10),8,20),1,\"\"))","v":""}]
[null,null,null,"2020-10-06",0,1,0,{"$f":"IF(Tool!$C$12-DATE((YEAR(Tool!$C$10)),8,20)<50,IF('Niche for catch crops'!D75=Tool!$C$12-50,1,\"\"),IF(D75=DATE(YEAR(Tool!$C$10),8,20),1,\"\"))","v":""}]
[null,null,null,"2020-10-07",0,1,0,{"$f":"IF(Tool!$C$12-DATE((YEAR(Tool!$C$10)),8,20)<50,IF('Niche for catch crops'!D76=Tool!$C$12-50,1,\"\"),IF(D76=DATE(YEAR(Tool!$C$10),8,20),1,\"\"))","v":""}]
[null,null,null,"2020-10-08",0,1,0,{"$f":"IF(Tool!$C$12-DATE((YEAR(Tool!$C$10)),8,20)<50,IF('Niche for catch crops'!D77=Tool!$C$12-50,1,\"\"),IF(D77=DATE(YEAR(Tool!$C$10),8,20),1,\"\"))","v":""}]
[null,null,null,"2020-10-09",0,1,0,{"$f":"IF(Tool!$C$12-DATE((YEAR(Tool!$C$10)),8,20)<50,IF('Niche for catch crops'!D78=Tool!$C$12-50,1,\"\"),IF(D78=DATE(YEAR(Tool!$C$10),8,20),1,\"\"))","v":""}]
[null,null,null,"2020-10-10",0,1,0,{"$f":"IF(Tool!$C$12-DATE((YEAR(Tool!$C$10)),8,20)<50,IF('Niche for catch crops'!D79=Tool!$C$12-50,1,\"\"),IF(D79=DATE(YEAR(Tool!$C$10),8,20),1,\"\"))","v":""}]
[null,null,null,"2020-10-11",0,1,0,{"$f":"IF(Tool!$C$12-DATE((YEAR(Tool!$C$10)),8,20)<50,IF('Niche for catch crops'!D80=Tool!$C$12-50,1,\"\"),IF(D80=DATE(YEAR(Tool!$C$10),8,20),1,\"\"))","v":""}]
[null,null,null,"2020-10-12",0,1,0,{"$f":"IF(Tool!$C$12-DATE((YEAR(Tool!$C$10)),8,20)<50,IF('Niche for catch crops'!D81=Tool!$C$12-50,1,\"\"),IF(D81=DATE(YEAR(Tool!$C$10),8,20),1,\"\"))","v":""}]
[null,null,null,"2020-10-13",0,1,0,{"$f":"IF(Tool!$C$12-DATE((YEAR(Tool!$C$10)),8,20)<50,IF('Niche for catch crops'!D82=Tool!$C$12-50,1,\"\"),IF(D82=DATE(YEAR(Tool!$C$10),8,20),1,\"\"))","v":""}]
[null,null,null,"2020-10-14",0,1,0,{"$f":"IF(Tool!$C$12-DATE((YEAR(Tool!$C$10)),8,20)<50,IF('Niche for catch crops'!D83=Tool!$C$12-50,1,\"\"),IF(D83=DATE(YEAR(Tool!$C$10),8,20),1,\"\"))","v":""}]
[null,null,null,"2020-10-15",0,1,0,{"$f":"IF(Tool!$C$12-DATE((YEAR(Tool!$C$10)),8,20)<50,IF('Niche for catch crops'!D84=Tool!$C$12-50,1,\"\"),IF(D84=DATE(YEAR(Tool!$C$10),8,20),1,\"\"))","v":""}]
[null,null,null,"2020-10-16",0,1,0,{"$f":"IF(Tool!$C$12-DATE((YEAR(Tool!$C$10)),8,20)<50,IF('Niche for catch crops'!D85=Tool!$C$12-50,1,\"\"),IF(D85=DATE(YEAR(Tool!$C$10),8,20),1,\"\"))","v":""}]
[null,null,null,"2020-10-17",0,1,0,{"$f":"IF(Tool!$C$12-DATE((YEAR(Tool!$C$10)),8,20)<50,IF('Niche for catch crops'!D86=Tool!$C$12-50,1,\"\"),IF(D86=DATE(YEAR(Tool!$C$10),8,20),1,\"\"))","v":""}]
[null,null,null,"2020-10-18",0,1,0,{"$f":"IF(Tool!$C$12-DATE((YEAR(Tool!$C$10)),8,20)<50,IF('Niche for catch crops'!D87=Tool!$C$12-50,1,\"\"),IF(D87=DATE(YEAR(Tool!$C$10),8,20),1,\"\"))","v":""}]
[null,null,null,"2020-10-19",0,1,0,{"$f":"IF(Tool!$C$12-DATE((YEAR(Tool!$C$10)),8,20)<50,IF('Niche for catch crops'!D88=Tool!$C$12-50,1,\"\"),IF(D88=DATE(YEAR(Tool!$C$10),8,20),1,\"\"))","v":""}]
[null,null,null,"2020-10-20",0,1,0,{"$f":"IF(Tool!$C$12-DATE((YEAR(Tool!$C$10)),8,20)<50,IF('Niche for catch crops'!D89=Tool!$C$12-50,1,\"\"),IF(D89=DATE(YEAR(Tool!$C$10),8,20),1,\"\"))","v":""}]
[null,null,null,"2020-10-21",0,1,0,{"$f":"IF(Tool!$C$12-DATE((YEAR(Tool!$C$10)),8,20)<50,IF('Niche for catch crops'!D90=Tool!$C$12-50,1,\"\"),IF(D90=DATE(YEAR(Tool!$C$10),8,20),1,\"\"))","v":""}]
[null,null,null,"2020-10-22",0,1,0,{"$f":"IF(Tool!$C$12-DATE((YEAR(Tool!$C$10)),8,20)<50,IF('Niche for catch crops'!D91=Tool!$C$12-50,1,\"\"),IF(D91=DATE(YEAR(Tool!$C$10),8,20),1,\"\"))","v":""}]
[null,null,null,"2020-10-23",0,1,0,{"$f":"IF(Tool!$C$12-DATE((YEAR(Tool!$C$10)),8,20)<50,IF('Niche for catch crops'!D92=Tool!$C$12-50,1,\"\"),IF(D92=DATE(YEAR(Tool!$C$10),8,20),1,\"\"))","v":""}]
[null,null,null,"2020-10-24",0,1,0,{"$f":"IF(Tool!$C$12-DATE((YEAR(Tool!$C$10)),8,20)<50,IF('Niche for catch crops'!D93=Tool!$C$12-50,1,\"\"),IF(D93=DATE(YEAR(Tool!$C$10),8,20),1,\"\"))","v":""}]
[null,null,null,"2020-10-25",0,1,0,{"$f":"IF(Tool!$C$12-DATE((YEAR(Tool!$C$10)),8,20)<50,IF('Niche for catch crops'!D94=Tool!$C$12-50,1,\"\"),IF(D94=DATE(YEAR(Tool!$C$10),8,20),1,\"\"))","v":""}]
[null,null,null,"2020-10-26",0,1,0,{"$f":"IF(Tool!$C$12-DATE((YEAR(Tool!$C$10)),8,20)<50,IF('Niche for catch crops'!D95=Tool!$C$12-50,1,\"\"),IF(D95=DATE(YEAR(Tool!$C$10),8,20),1,\"\"))","v":""}]
[null,null,null,"2020-10-27",0,1,0,{"$f":"IF(Tool!$C$12-DATE((YEAR(Tool!$C$10)),8,20)<50,IF('Niche for catch crops'!D96=Tool!$C$12-50,1,\"\"),IF(D96=DATE(YEAR(Tool!$C$10),8,20),1,\"\"))","v":""}]
[null,null,null,"2020-10-28",0,1,0,{"$f":"IF(Tool!$C$12-DATE((YEAR(Tool!$C$10)),8,20)<50,IF('Niche for catch crops'!D97=Tool!$C$12-50,1,\"\"),IF(D97=DATE(YEAR(Tool!$C$10),8,20),1,\"\"))","v":""}]
[null,null,null,"2020-10-29",0,1,0,{"$f":"IF(Tool!$C$12-DATE((YEAR(Tool!$C$10)),8,20)<50,IF('Niche for catch crops'!D98=Tool!$C$12-50,1,\"\"),IF(D98=DATE(YEAR(Tool!$C$10),8,20),1,\"\"))","v":""}]
[null,null,null,"2020-10-30",{"$f":"IF((OR(D99<$B$2, D99>$B$3)),1,0)","v":0},1,0,{"$f":"IF(Tool!$C$12-DATE((YEAR(Tool!$C$10)),8,20)<50,IF('Niche for catch crops'!D99=Tool!$C$12-50,1,\"\"),IF(D99=DATE(YEAR(Tool!$C$10),8,20),1,\"\"))","v":""}]
[null,null,null,"2020-10-31",0,1,0,{"$f":"IF(Tool!$C$12-DATE((YEAR(Tool!$C$10)),8,20)<50,IF('Niche for catch crops'!D100=Tool!$C$12-50,1,\"\"),IF(D100=DATE(YEAR(Tool!$C$10),8,20),1,\"\"))","v":""}]
[null,null,null,"2020-11-01",0,1,0,{"$f":"IF(Tool!$C$12-DATE((YEAR(Tool!$C$10)),8,20)<50,IF('Niche for catch crops'!D101=Tool!$C$12-50,1,\"\"),IF(D101=DATE(YEAR(Tool!$C$10),8,20),1,\"\"))","v":""}]
[null,null,null,"2020-11-02",0,1,0,{"$f":"IF(Tool!$C$12-DATE((YEAR(Tool!$C$10)),8,20)<50,IF('Niche for catch crops'!D102=Tool!$C$12-50,1,\"\"),IF(D102=DATE(YEAR(Tool!$C$10),8,20),1,\"\"))","v":""}]
[null,null,null,"2020-11-03",0,1,0,{"$f":"IF(Tool!$C$12-DATE((YEAR(Tool!$C$10)),8,20)<50,IF('Niche for catch crops'!D103=Tool!$C$12-50,1,\"\"),IF(D103=DATE(YEAR(Tool!$C$10),8,20),1,\"\"))","v":""}]
[null,null,null,"2020-11-04",0,1,0,{"$f":"IF(Tool!$C$12-DATE((YEAR(Tool!$C$10)),8,20)<50,IF('Niche for catch crops'!D104=Tool!$C$12-50,1,\"\"),IF(D104=DATE(YEAR(Tool!$C$10),8,20),1,\"\"))","v":""}]
[null,null,null,"2020-11-05",0,1,0,{"$f":"IF(Tool!$C$12-DATE((YEAR(Tool!$C$10)),8,20)<50,IF('Niche for catch crops'!D105=Tool!$C$12-50,1,\"\"),IF(D105=DATE(YEAR(Tool!$C$10),8,20),1,\"\"))","v":""}]
[null,null,null,"2020-11-06",0,1,0,{"$f":"IF(Tool!$C$12-DATE((YEAR(Tool!$C$10)),8,20)<50,IF('Niche for catch crops'!D106=Tool!$C$12-50,1,\"\"),IF(D106=DATE(YEAR(Tool!$C$10),8,20),1,\"\"))","v":""}]
[null,null,null,"2020-11-07",0,1,0,{"$f":"IF(Tool!$C$12-DATE((YEAR(Tool!$C$10)),8,20)<50,IF('Niche for catch crops'!D107=Tool!$C$12-50,1,\"\"),IF(D107=DATE(YEAR(Tool!$C$10),8,20),1,\"\"))","v":""}]
[null,null,null,"2020-11-08",0,1,0,{"$f":"IF(Tool!$C$12-DATE((YEAR(Tool!$C$10)),8,20)<50,IF('Niche for catch crops'!D108=Tool!$C$12-50,1,\"\"),IF(D108=DATE(YEAR(Tool!$C$10),8,20),1,\"\"))","v":""}]
[null,null,null,"2020-11-09",0,1,0,{"$f":"IF(Tool!$C$12-DATE((YEAR(Tool!$C$10)),8,20)<50,IF('Niche for catch crops'!D109=Tool!$C$12-50,1,\"\"),IF(D109=DATE(YEAR(Tool!$C$10),8,20),1,\"\"))","v":""}]
[null,null,null,"2020-11-10",0,1,0,{"$f":"IF(Tool!$C$12-DATE((YEAR(Tool!$C$10)),8,20)<50,IF('Niche for catch crops'!D110=Tool!$C$12-50,1,\"\"),IF(D110=DATE(YEAR(Tool!$C$10),8,20),1,\"\"))","v":""}]
[null,null,null,"2020-11-11",0,1,0,{"$f":"IF(Tool!$C$12-DATE((YEAR(Tool!$C$10)),8,20)<50,IF('Niche for catch crops'!D111=Tool!$C$12-50,1,\"\"),IF(D111=DATE(YEAR(Tool!$C$10),8,20),1,\"\"))","v":""}]
[null,null,null,"2020-11-12",0,1,0,{"$f":"IF(Tool!$C$12-DATE((YEAR(Tool!$C$10)),8,20)<50,IF('Niche for catch crops'!D112=Tool!$C$12-50,1,\"\"),IF(D112=DATE(YEAR(Tool!$C$10),8,20),1,\"\"))","v":""}]
[null,null,null,"2020-11-13",0,1,0,{"$f":"IF(Tool!$C$12-DATE((YEAR(Tool!$C$10)),8,20)<50,IF('Niche for catch crops'!D113=Tool!$C$12-50,1,\"\"),IF(D113=DATE(YEAR(Tool!$C$10),8,20),1,\"\"))","v":""}]
[null,null,null,"2020-11-14",0,1,0,{"$f":"IF(Tool!$C$12-DATE((YEAR(Tool!$C$10)),8,20)<50,IF('Niche for catch crops'!D114=Tool!$C$12-50,1,\"\"),IF(D114=DATE(YEAR(Tool!$C$10),8,20),1,\"\"))","v":""}]
[null,null,null,"2020-11-15",0,1,0,{"$f":"IF(Tool!$C$12-DATE((YEAR(Tool!$C$10)),8,20)<50,IF('Niche for catch crops'!D115=Tool!$C$12-50,1,\"\"),IF(D115=DATE(YEAR(Tool!$C$10),8,20),1,\"\"))","v":""}]
[null,null,null,"2020-11-16",0,1,0,{"$f":"IF(Tool!$C$12-DATE((YEAR(Tool!$C$10)),8,20)<50,IF('Niche for catch crops'!D116=Tool!$C$12-50,1,\"\"),IF(D116=DATE(YEAR(Tool!$C$10),8,20),1,\"\"))","v":""}]
[null,null,null,"2020-11-17",0,1,0,{"$f":"IF(Tool!$C$12-DATE((YEAR(Tool!$C$10)),8,20)<50,IF('Niche for catch crops'!D117=Tool!$C$12-50,1,\"\"),IF(D117=DATE(YEAR(Tool!$C$10),8,20),1,\"\"))","v":""}]
[null,null,null,"2020-11-18",0,1,0,{"$f":"IF(Tool!$C$12-DATE((YEAR(Tool!$C$10)),8,20)<50,IF('Niche for catch crops'!D118=Tool!$C$12-50,1,\"\"),IF(D118=DATE(YEAR(Tool!$C$10),8,20),1,\"\"))","v":""}]
[null,null,null,"2020-11-19",0,1,0,{"$f":"IF(Tool!$C$12-DATE((YEAR(Tool!$C$10)),8,20)<50,IF('Niche for catch crops'!D119=Tool!$C$12-50,1,\"\"),IF(D119=DATE(YEAR(Tool!$C$10),8,20),1,\"\"))","v":""}]
[null,null,null,"2020-11-20",0,1,0,{"$f":"IF(Tool!$C$12-DATE((YEAR(Tool!$C$10)),8,20)<50,IF('Niche for catch crops'!D120=Tool!$C$12-50,1,\"\"),IF(D120=DATE(YEAR(Tool!$C$10),8,20),1,\"\"))","v":""}]
[null,null,null,"2020-11-21",0,1,0,{"$f":"IF(Tool!$C$12-DATE((YEAR(Tool!$C$10)),8,20)<50,IF('Niche for catch crops'!D121=Tool!$C$12-50,1,\"\"),IF(D121=DATE(YEAR(Tool!$C$10),8,20),1,\"\"))","v":""}]
[null,null,null,"2020-11-22",0,1,0,{"$f":"IF(Tool!$C$12-DATE((YEAR(Tool!$C$10)),8,20)<50,IF('Niche for catch crops'!D122=Tool!$C$12-50,1,\"\"),IF(D122=DATE(YEAR(Tool!$C$10),8,20),1,\"\"))","v":""}]
[null,null,null,"2020-11-23",0,1,0,{"$f":"IF(Tool!$C$12-DATE((YEAR(Tool!$C$10)),8,20)<50,IF('Niche for catch crops'!D123=Tool!$C$12-50,1,\"\"),IF(D123=DATE(YEAR(Tool!$C$10),8,20),1,\"\"))","v":""}]
[null,null,null,"2020-11-24",0,1,0,{"$f":"IF(Tool!$C$12-DATE((YEAR(Tool!$C$10)),8,20)<50,IF('Niche for catch crops'!D124=Tool!$C$12-50,1,\"\"),IF(D124=DATE(YEAR(Tool!$C$10),8,20),1,\"\"))","v":""}]
[null,null,null,"2020-11-25",0,1,0,{"$f":"IF(Tool!$C$12-DATE((YEAR(Tool!$C$10)),8,20)<50,IF('Niche for catch crops'!D125=Tool!$C$12-50,1,\"\"),IF(D125=DATE(YEAR(Tool!$C$10),8,20),1,\"\"))","v":""}]
[null,null,null,"2020-11-26",0,1,0,{"$f":"IF(Tool!$C$12-DATE((YEAR(Tool!$C$10)),8,20)<50,IF('Niche for catch crops'!D126=Tool!$C$12-50,1,\"\"),IF(D126=DATE(YEAR(Tool!$C$10),8,20),1,\"\"))","v":""}]
[null,null,null,"2020-11-27",0,1,0,{"$f":"IF(Tool!$C$12-DATE((YEAR(Tool!$C$10)),8,20)<50,IF('Niche for catch crops'!D127=Tool!$C$12-50,1,\"\"),IF(D127=DATE(YEAR(Tool!$C$10),8,20),1,\"\"))","v":""}]
[null,null,null,"2020-11-28",0,1,0,{"$f":"IF(Tool!$C$12-DATE((YEAR(Tool!$C$10)),8,20)<50,IF('Niche for catch crops'!D128=Tool!$C$12-50,1,\"\"),IF(D128=DATE(YEAR(Tool!$C$10),8,20),1,\"\"))","v":""}]
[null,null,null,"2020-11-29",0,1,0,{"$f":"IF(Tool!$C$12-DATE((YEAR(Tool!$C$10)),8,20)<50,IF('Niche for catch crops'!D129=Tool!$C$12-50,1,\"\"),IF(D129=DATE(YEAR(Tool!$C$10),8,20),1,\"\"))","v":""}]
[null,null,null,"2020-11-30",0,1,0,{"$f":"IF(Tool!$C$12-DATE((YEAR(Tool!$C$10)),8,20)<50,IF('Niche for catch crops'!D130=Tool!$C$12-50,1,\"\"),IF(D130=DATE(YEAR(Tool!$C$10),8,20),1,\"\"))","v":""}]
[null,null,null,"2020-12-01",{"$f":"IF((OR(D131<$B$2, D131>$B$3)),1,0)","v":0},1,0,{"$f":"IF(Tool!$C$12-DATE((YEAR(Tool!$C$10)),8,20)<50,IF('Niche for catch crops'!D131=Tool!$C$12-50,1,\"\"),IF(D131=DATE(YEAR(Tool!$C$10),8,20),1,\"\"))","v":""}]
[null,null,null,"2020-12-02",0,{"$f":"IF($B$3-$B$2>60,1-E132,0)","v":1},{"$f":"IF($B$3-$B$2<60,1-E132,0)","v":0},{"$f":"IF(Tool!$C$12-DATE((YEAR(Tool!$C$10)),8,20)<50,IF('Niche for catch crops'!D132=Tool!$C$12-50,1,\"\"),IF(D132=DATE(YEAR(Tool!$C$10),8,20),1,\"\"))","v":""}]
[null,null,null,{"$f":"D132+1","v":"2020-12-03"},0,1,0,{"$f":"IF(Tool!$C$12-DATE((YEAR(Tool!$C$10)),8,20)<50,IF('Niche for catch crops'!D133=Tool!$C$12-50,1,\"\"),IF(D133=DATE(YEAR(Tool!$C$10),8,20),1,\"\"))","v":""}]
[null,null,null,"2020-12-04",0,1,0,{"$f":"IF(Tool!$C$12-DATE((YEAR(Tool!$C$10)),8,20)<50,IF('Niche for catch crops'!D134=Tool!$C$12-50,1,\"\"),IF(D134=DATE(YEAR(Tool!$C$10),8,20),1,\"\"))","v":""}]
[null,null,null,"2020-12-05",0,1,0,{"$f":"IF(Tool!$C$12-DATE((YEAR(Tool!$C$10)),8,20)<50,IF('Niche for catch crops'!D135=Tool!$C$12-50,1,\"\"),IF(D135=DATE(YEAR(Tool!$C$10),8,20),1,\"\"))","v":""}]
[null,null,null,"2020-12-06",0,1,0,{"$f":"IF(Tool!$C$12-DATE((YEAR(Tool!$C$10)),8,20)<50,IF('Niche for catch crops'!D136=Tool!$C$12-50,1,\"\"),IF(D136=DATE(YEAR(Tool!$C$10),8,20),1,\"\"))","v":""}]
[null,null,null,"2020-12-07",0,1,0,{"$f":"IF(Tool!$C$12-DATE((YEAR(Tool!$C$10)),8,20)<50,IF('Niche for catch crops'!D137=Tool!$C$12-50,1,\"\"),IF(D137=DATE(YEAR(Tool!$C$10),8,20),1,\"\"))","v":""}]
[null,null,null,"2020-12-08",0,1,0,{"$f":"IF(Tool!$C$12-DATE((YEAR(Tool!$C$10)),8,20)<50,IF('Niche for catch crops'!D138=Tool!$C$12-50,1,\"\"),IF(D138=DATE(YEAR(Tool!$C$10),8,20),1,\"\"))","v":""}]
[null,null,null,"2020-12-09",0,1,0,{"$f":"IF(Tool!$C$12-DATE((YEAR(Tool!$C$10)),8,20)<50,IF('Niche for catch crops'!D139=Tool!$C$12-50,1,\"\"),IF(D139=DATE(YEAR(Tool!$C$10),8,20),1,\"\"))","v":""}]
[null,null,null,"2020-12-10",0,1,0,{"$f":"IF(Tool!$C$12-DATE((YEAR(Tool!$C$10)),8,20)<50,IF('Niche for catch crops'!D140=Tool!$C$12-50,1,\"\"),IF(D140=DATE(YEAR(Tool!$C$10),8,20),1,\"\"))","v":""}]
[null,null,null,"2020-12-11",0,1,0,{"$f":"IF(Tool!$C$12-DATE((YEAR(Tool!$C$10)),8,20)<50,IF('Niche for catch crops'!D141=Tool!$C$12-50,1,\"\"),IF(D141=DATE(YEAR(Tool!$C$10),8,20),1,\"\"))","v":""}]
[null,null,null,"2020-12-12",0,1,0,{"$f":"IF(Tool!$C$12-DATE((YEAR(Tool!$C$10)),8,20)<50,IF('Niche for catch crops'!D142=Tool!$C$12-50,1,\"\"),IF(D142=DATE(YEAR(Tool!$C$10),8,20),1,\"\"))","v":""}]
[null,null,null,"2020-12-13",0,1,0,{"$f":"IF(Tool!$C$12-DATE((YEAR(Tool!$C$10)),8,20)<50,IF('Niche for catch crops'!D143=Tool!$C$12-50,1,\"\"),IF(D143=DATE(YEAR(Tool!$C$10),8,20),1,\"\"))","v":""}]
[null,null,null,"2020-12-14",0,1,0,{"$f":"IF(Tool!$C$12-DATE((YEAR(Tool!$C$10)),8,20)<50,IF('Niche for catch crops'!D144=Tool!$C$12-50,1,\"\"),IF(D144=DATE(YEAR(Tool!$C$10),8,20),1,\"\"))","v":""}]
[null,null,null,"2020-12-15",0,1,0,{"$f":"IF(Tool!$C$12-DATE((YEAR(Tool!$C$10)),8,20)<50,IF('Niche for catch crops'!D145=Tool!$C$12-50,1,\"\"),IF(D145=DATE(YEAR(Tool!$C$10),8,20),1,\"\"))","v":""}]
[null,null,null,"2020-12-16",0,1,0,{"$f":"IF(Tool!$C$12-DATE((YEAR(Tool!$C$10)),8,20)<50,IF('Niche for catch crops'!D146=Tool!$C$12-50,1,\"\"),IF(D146=DATE(YEAR(Tool!$C$10),8,20),1,\"\"))","v":""}]
[null,null,null,"2020-12-17",0,1,0,{"$f":"IF(Tool!$C$12-DATE((YEAR(Tool!$C$10)),8,20)<50,IF('Niche for catch crops'!D147=Tool!$C$12-50,1,\"\"),IF(D147=DATE(YEAR(Tool!$C$10),8,20),1,\"\"))","v":""}]
[null,null,null,"2020-12-18",0,1,0,{"$f":"IF(Tool!$C$12-DATE((YEAR(Tool!$C$10)),8,20)<50,IF('Niche for catch crops'!D148=Tool!$C$12-50,1,\"\"),IF(D148=DATE(YEAR(Tool!$C$10),8,20),1,\"\"))","v":""}]
[null,null,null,"2020-12-19",0,1,0,{"$f":"IF(Tool!$C$12-DATE((YEAR(Tool!$C$10)),8,20)<50,IF('Niche for catch crops'!D149=Tool!$C$12-50,1,\"\"),IF(D149=DATE(YEAR(Tool!$C$10),8,20),1,\"\"))","v":""}]
[null,null,null,"2020-12-20",0,1,0,{"$f":"IF(Tool!$C$12-DATE((YEAR(Tool!$C$10)),8,20)<50,IF('Niche for catch crops'!D150=Tool!$C$12-50,1,\"\"),IF(D150=DATE(YEAR(Tool!$C$10),8,20),1,\"\"))","v":""}]
[null,null,null,"2020-12-21",0,1,0,{"$f":"IF(Tool!$C$12-DATE((YEAR(Tool!$C$10)),8,20)<50,IF('Niche for catch crops'!D151=Tool!$C$12-50,1,\"\"),IF(D151=DATE(YEAR(Tool!$C$10),8,20),1,\"\"))","v":""}]
[null,null,null,"2020-12-22",0,1,0,{"$f":"IF(Tool!$C$12-DATE((YEAR(Tool!$C$10)),8,20)<50,IF('Niche for catch crops'!D152=Tool!$C$12-50,1,\"\"),IF(D152=DATE(YEAR(Tool!$C$10),8,20),1,\"\"))","v":""}]
[null,null,null,"2020-12-23",0,1,0,{"$f":"IF(Tool!$C$12-DATE((YEAR(Tool!$C$10)),8,20)<50,IF('Niche for catch crops'!D153=Tool!$C$12-50,1,\"\"),IF(D153=DATE(YEAR(Tool!$C$10),8,20),1,\"\"))","v":""}]
[null,null,null,"2020-12-24",0,1,0,{"$f":"IF(Tool!$C$12-DATE((YEAR(Tool!$C$10)),8,20)<50,IF('Niche for catch crops'!D154=Tool!$C$12-50,1,\"\"),IF(D154=DATE(YEAR(Tool!$C$10),8,20),1,\"\"))","v":""}]
[null,null,null,"2020-12-25",0,1,0,{"$f":"IF(Tool!$C$12-DATE((YEAR(Tool!$C$10)),8,20)<50,IF('Niche for catch crops'!D155=Tool!$C$12-50,1,\"\"),IF(D155=DATE(YEAR(Tool!$C$10),8,20),1,\"\"))","v":""}]
[null,null,null,"2020-12-26",0,1,0,{"$f":"IF(Tool!$C$12-DATE((YEAR(Tool!$C$10)),8,20)<50,IF('Niche for catch crops'!D156=Tool!$C$12-50,1,\"\"),IF(D156=DATE(YEAR(Tool!$C$10),8,20),1,\"\"))","v":""}]
[null,null,null,"2020-12-27",0,1,0,{"$f":"IF(Tool!$C$12-DATE((YEAR(Tool!$C$10)),8,20)<50,IF('Niche for catch crops'!D157=Tool!$C$12-50,1,\"\"),IF(D157=DATE(YEAR(Tool!$C$10),8,20),1,\"\"))","v":""}]
[null,null,null,"2020-12-28",0,1,0,{"$f":"IF(Tool!$C$12-DATE((YEAR(Tool!$C$10)),8,20)<50,IF('Niche for catch crops'!D158=Tool!$C$12-50,1,\"\"),IF(D158=DATE(YEAR(Tool!$C$10),8,20),1,\"\"))","v":""}]
[null,null,null,"2020-12-29",0,1,0,{"$f":"IF(Tool!$C$12-DATE((YEAR(Tool!$C$10)),8,20)<50,IF('Niche for catch crops'!D159=Tool!$C$12-50,1,\"\"),IF(D159=DATE(YEAR(Tool!$C$10),8,20),1,\"\"))","v":""}]
[null,null,null,"2020-12-30",0,1,0,{"$f":"IF(Tool!$C$12-DATE((YEAR(Tool!$C$10)),8,20)<50,IF('Niche for catch crops'!D160=Tool!$C$12-50,1,\"\"),IF(D160=DATE(YEAR(Tool!$C$10),8,20),1,\"\"))","v":""}]
[null,null,null,"2020-12-31",0,1,0,{"$f":"IF(Tool!$C$12-DATE((YEAR(Tool!$C$10)),8,20)<50,IF('Niche for catch crops'!D161=Tool!$C$12-50,1,\"\"),IF(D161=DATE(YEAR(Tool!$C$10),8,20),1,\"\"))","v":""}]
[null,null,null,"2021-01-01",0,1,0,{"$f":"IF(Tool!$C$12-DATE((YEAR(Tool!$C$10)),8,20)<50,IF('Niche for catch crops'!D162=Tool!$C$12-50,1,\"\"),IF(D162=DATE(YEAR(Tool!$C$10),8,20),1,\"\"))","v":""}]
[null,null,null,"2021-01-02",{"$f":"IF((OR(D163<$B$2, D163>$B$3)),1,0)","v":0},1,0,{"$f":"IF(Tool!$C$12-DATE((YEAR(Tool!$C$10)),8,20)<50,IF('Niche for catch crops'!D163=Tool!$C$12-50,1,\"\"),IF(D163=DATE(YEAR(Tool!$C$10),8,20),1,\"\"))","v":""}]
[null,null,null,"2021-01-03",0,1,0,{"$f":"IF(Tool!$C$12-DATE((YEAR(Tool!$C$10)),8,20)<50,IF('Niche for catch crops'!D164=Tool!$C$12-50,1,\"\"),IF(D164=DATE(YEAR(Tool!$C$10),8,20),1,\"\"))","v":""}]
[null,null,null,"2021-01-04",0,1,0,{"$f":"IF(Tool!$C$12-DATE((YEAR(Tool!$C$10)),8,20)<50,IF('Niche for catch crops'!D165=Tool!$C$12-50,1,\"\"),IF(D165=DATE(YEAR(Tool!$C$10),8,20),1,\"\"))","v":""}]
[null,null,null,"2021-01-05",0,1,0,{"$f":"IF(Tool!$C$12-DATE((YEAR(Tool!$C$10)),8,20)<50,IF('Niche for catch crops'!D166=Tool!$C$12-50,1,\"\"),IF(D166=DATE(YEAR(Tool!$C$10),8,20),1,\"\"))","v":""}]
[null,null,null,"2021-01-06",0,1,0,{"$f":"IF(Tool!$C$12-DATE((YEAR(Tool!$C$10)),8,20)<50,IF('Niche for catch crops'!D167=Tool!$C$12-50,1,\"\"),IF(D167=DATE(YEAR(Tool!$C$10),8,20),1,\"\"))","v":""}]
[null,null,null,"2021-01-07",0,1,0,{"$f":"IF(Tool!$C$12-DATE((YEAR(Tool!$C$10)),8,20)<50,IF('Niche for catch crops'!D168=Tool!$C$12-50,1,\"\"),IF(D168=DATE(YEAR(Tool!$C$10),8,20),1,\"\"))","v":""}]
[null,null,null,"2021-01-08",0,1,0,{"$f":"IF(Tool!$C$12-DATE((YEAR(Tool!$C$10)),8,20)<50,IF('Niche for catch crops'!D169=Tool!$C$12-50,1,\"\"),IF(D169=DATE(YEAR(Tool!$C$10),8,20),1,\"\"))","v":""}]
[null,null,null,"2021-01-09",0,1,0,{"$f":"IF(Tool!$C$12-DATE((YEAR(Tool!$C$10)),8,20)<50,IF('Niche for catch crops'!D170=Tool!$C$12-50,1,\"\"),IF(D170=DATE(YEAR(Tool!$C$10),8,20),1,\"\"))","v":""}]
[null,null,null,"2021-01-10",0,1,0,{"$f":"IF(Tool!$C$12-DATE((YEAR(Tool!$C$10)),8,20)<50,IF('Niche for catch crops'!D171=Tool!$C$12-50,1,\"\"),IF(D171=DATE(YEAR(Tool!$C$10),8,20),1,\"\"))","v":""}]
[null,null,null,"2021-01-11",0,1,0,{"$f":"IF(Tool!$C$12-DATE((YEAR(Tool!$C$10)),8,20)<50,IF('Niche for catch crops'!D172=Tool!$C$12-50,1,\"\"),IF(D172=DATE(YEAR(Tool!$C$10),8,20),1,\"\"))","v":""}]
[null,null,null,"2021-01-12",0,1,0,{"$f":"IF(Tool!$C$12-DATE((YEAR(Tool!$C$10)),8,20)<50,IF('Niche for catch crops'!D173=Tool!$C$12-50,1,\"\"),IF(D173=DATE(YEAR(Tool!$C$10),8,20),1,\"\"))","v":""}]
[null,null,null,"2021-01-13",0,1,0,{"$f":"IF(Tool!$C$12-DATE((YEAR(Tool!$C$10)),8,20)<50,IF('Niche for catch crops'!D174=Tool!$C$12-50,1,\"\"),IF(D174=DATE(YEAR(Tool!$C$10),8,20),1,\"\"))","v":""}]
[null,null,null,"2021-01-14",0,1,0,{"$f":"IF(Tool!$C$12-DATE((YEAR(Tool!$C$10)),8,20)<50,IF('Niche for catch crops'!D175=Tool!$C$12-50,1,\"\"),IF(D175=DATE(YEAR(Tool!$C$10),8,20),1,\"\"))","v":""}]
[null,null,null,"2021-01-15",0,1,0,{"$f":"IF(Tool!$C$12-DATE((YEAR(Tool!$C$10)),8,20)<50,IF('Niche for catch crops'!D176=Tool!$C$12-50,1,\"\"),IF(D176=DATE(YEAR(Tool!$C$10),8,20),1,\"\"))","v":""}]
[null,null,null,"2021-01-16",0,1,0,{"$f":"IF(Tool!$C$12-DATE((YEAR(Tool!$C$10)),8,20)<50,IF('Niche for catch crops'!D177=Tool!$C$12-50,1,\"\"),IF(D177=DATE(YEAR(Tool!$C$10),8,20),1,\"\"))","v":""}]
[null,null,null,"2021-01-17",0,1,0,{"$f":"IF(Tool!$C$12-DATE((YEAR(Tool!$C$10)),8,20)<50,IF('Niche for catch crops'!D178=Tool!$C$12-50,1,\"\"),IF(D178=DATE(YEAR(Tool!$C$10),8,20),1,\"\"))","v":""}]
[null,null,null,"2021-01-18",0,1,0,{"$f":"IF(Tool!$C$12-DATE((YEAR(Tool!$C$10)),8,20)<50,IF('Niche for catch crops'!D179=Tool!$C$12-50,1,\"\"),IF(D179=DATE(YEAR(Tool!$C$10),8,20),1,\"\"))","v":""}]
[null,null,null,"2021-01-19",0,1,0,{"$f":"IF(Tool!$C$12-DATE((YEAR(Tool!$C$10)),8,20)<50,IF('Niche for catch crops'!D180=Tool!$C$12-50,1,\"\"),IF(D180=DATE(YEAR(Tool!$C$10),8,20),1,\"\"))","v":""}]
[null,null,null,"2021-01-20",0,1,0,{"$f":"IF(Tool!$C$12-DATE((YEAR(Tool!$C$10)),8,20)<50,IF('Niche for catch crops'!D181=Tool!$C$12-50,1,\"\"),IF(D181=DATE(YEAR(Tool!$C$10),8,20),1,\"\"))","v":""}]
[null,null,null,"2021-01-21",0,1,0,{"$f":"IF(Tool!$C$12-DATE((YEAR(Tool!$C$10)),8,20)<50,IF('Niche for catch crops'!D182=Tool!$C$12-50,1,\"\"),IF(D182=DATE(YEAR(Tool!$C$10),8,20),1,\"\"))","v":""}]
[null,null,null,"2021-01-22",0,1,0,{"$f":"IF(Tool!$C$12-DATE((YEAR(Tool!$C$10)),8,20)<50,IF('Niche for catch crops'!D183=Tool!$C$12-50,1,\"\"),IF(D183=DATE(YEAR(Tool!$C$10),8,20),1,\"\"))","v":""}]
[null,null,null,"2021-01-23",0,1,0,{"$f":"IF(Tool!$C$12-DATE((YEAR(Tool!$C$10)),8,20)<50,IF('Niche for catch crops'!D184=Tool!$C$12-50,1,\"\"),IF(D184=DATE(YEAR(Tool!$C$10),8,20),1,\"\"))","v":""}]
[null,null,null,"2021-01-24",0,1,0,{"$f":"IF(Tool!$C$12-DATE((YEAR(Tool!$C$10)),8,20)<50,IF('Niche for catch crops'!D185=Tool!$C$12-50,1,\"\"),IF(D185=DATE(YEAR(Tool!$C$10),8,20),1,\"\"))","v":""}]
[null,null,null,"2021-01-25",0,1,0,{"$f":"IF(Tool!$C$12-DATE((YEAR(Tool!$C$10)),8,20)<50,IF('Niche for catch crops'!D186=Tool!$C$12-50,1,\"\"),IF(D186=DATE(YEAR(Tool!$C$10),8,20),1,\"\"))","v":""}]
[null,null,null,"2021-01-26",0,1,0,{"$f":"IF(Tool!$C$12-DATE((YEAR(Tool!$C$10)),8,20)<50,IF('Niche for catch crops'!D187=Tool!$C$12-50,1,\"\"),IF(D187=DATE(YEAR(Tool!$C$10),8,20),1,\"\"))","v":""}]
[null,null,null,"2021-01-27",0,1,0,{"$f":"IF(Tool!$C$12-DATE((YEAR(Tool!$C$10)),8,20)<50,IF('Niche for catch crops'!D188=Tool!$C$12-50,1,\"\"),IF(D188=DATE(YEAR(Tool!$C$10),8,20),1,\"\"))","v":""}]
[null,null,null,"2021-01-28",0,1,0,{"$f":"IF(Tool!$C$12-DATE((YEAR(Tool!$C$10)),8,20)<50,IF('Niche for catch crops'!D189=Tool!$C$12-50,1,\"\"),IF(D189=DATE(YEAR(Tool!$C$10),8,20),1,\"\"))","v":""}]
[null,null,null,"2021-01-29",0,1,0,{"$f":"IF(Tool!$C$12-DATE((YEAR(Tool!$C$10)),8,20)<50,IF('Niche for catch crops'!D190=Tool!$C$12-50,1,\"\"),IF(D190=DATE(YEAR(Tool!$C$10),8,20),1,\"\"))","v":""}]
[null,null,null,"2021-01-30",0,1,0,{"$f":"IF(Tool!$C$12-DATE((YEAR(Tool!$C$10)),8,20)<50,IF('Niche for catch crops'!D191=Tool!$C$12-50,1,\"\"),IF(D191=DATE(YEAR(Tool!$C$10),8,20),1,\"\"))","v":""}]
[null,null,null,"2021-01-31",0,1,0,{"$f":"IF(Tool!$C$12-DATE((YEAR(Tool!$C$10)),8,20)<50,IF('Niche for catch crops'!D192=Tool!$C$12-50,1,\"\"),IF(D192=DATE(YEAR(Tool!$C$10),8,20),1,\"\"))","v":""}]
[null,null,null,"2021-02-01",0,1,0,{"$f":"IF(Tool!$C$12-DATE((YEAR(Tool!$C$10)),8,20)<50,IF('Niche for catch crops'!D193=Tool!$C$12-50,1,\"\"),IF(D193=DATE(YEAR(Tool!$C$10),8,20),1,\"\"))","v":""}]
[null,null,null,"2021-02-02",0,1,0,{"$f":"IF(Tool!$C$12-DATE((YEAR(Tool!$C$10)),8,20)<50,IF('Niche for catch crops'!D194=Tool!$C$12-50,1,\"\"),IF(D194=DATE(YEAR(Tool!$C$10),8,20),1,\"\"))","v":""}]
[null,null,null,"2021-02-03",{"$f":"IF((OR(D195<$B$2, D195>$B$3)),1,0)","v":0},1,0,{"$f":"IF(Tool!$C$12-DATE((YEAR(Tool!$C$10)),8,20)<50,IF('Niche for catch crops'!D195=Tool!$C$12-50,1,\"\"),IF(D195=DATE(YEAR(Tool!$C$10),8,20),1,\"\"))","v":""}]
[null,null,null,"2021-02-04",0,{"$f":"IF($B$3-$B$2>60,1-E196,0)","v":1},{"$f":"IF($B$3-$B$2<60,1-E196,0)","v":0},{"$f":"IF(Tool!$C$12-DATE((YEAR(Tool!$C$10)),8,20)<50,IF('Niche for catch crops'!D196=Tool!$C$12-50,1,\"\"),IF(D196=DATE(YEAR(Tool!$C$10),8,20),1,\"\"))","v":""}]
[null,null,null,{"$f":"D196+1","v":"2021-02-05"},0,1,0,{"$f":"IF(Tool!$C$12-DATE((YEAR(Tool!$C$10)),8,20)<50,IF('Niche for catch crops'!D197=Tool!$C$12-50,1,\"\"),IF(D197=DATE(YEAR(Tool!$C$10),8,20),1,\"\"))","v":""}]
[null,null,null,"2021-02-06",0,1,0,{"$f":"IF(Tool!$C$12-DATE((YEAR(Tool!$C$10)),8,20)<50,IF('Niche for catch crops'!D198=Tool!$C$12-50,1,\"\"),IF(D198=DATE(YEAR(Tool!$C$10),8,20),1,\"\"))","v":""}]
[null,null,null,"2021-02-07",0,1,0,{"$f":"IF(Tool!$C$12-DATE((YEAR(Tool!$C$10)),8,20)<50,IF('Niche for catch crops'!D199=Tool!$C$12-50,1,\"\"),IF(D199=DATE(YEAR(Tool!$C$10),8,20),1,\"\"))","v":""}]
[null,null,null,"2021-02-08",0,1,0,{"$f":"IF(Tool!$C$12-DATE((YEAR(Tool!$C$10)),8,20)<50,IF('Niche for catch crops'!D200=Tool!$C$12-50,1,\"\"),IF(D200=DATE(YEAR(Tool!$C$10),8,20),1,\"\"))","v":""}]
[null,null,null,"2021-02-09",0,1,0,{"$f":"IF(Tool!$C$12-DATE((YEAR(Tool!$C$10)),8,20)<50,IF('Niche for catch crops'!D201=Tool!$C$12-50,1,\"\"),IF(D201=DATE(YEAR(Tool!$C$10),8,20),1,\"\"))","v":""}]
[null,null,null,"2021-02-10",0,1,0,{"$f":"IF(Tool!$C$12-DATE((YEAR(Tool!$C$10)),8,20)<50,IF('Niche for catch crops'!D202=Tool!$C$12-50,1,\"\"),IF(D202=DATE(YEAR(Tool!$C$10),8,20),1,\"\"))","v":""}]

{"sheet":"Data for Pivots","index":10,"n_rows":715,"n_cols":6,"rows_kept":715,"cut":false,"hidden":true,"merged":[]}
["Feature","Title","Catch crop","Value_text","Value","Filter"]
["Store excess N","Performance and role","Baltosios garstyčios","Good",2,{"$f":"HLOOKUP(Table1[[#This Row],[Catch crop]], Tool!C$29:M$29,1,0)","v":"Baltosios garstyčios"}]
["Organic matter improvement","Performance and role","Baltosios garstyčios","Very good",3,{"$f":"HLOOKUP(Table1[[#This Row],[Catch crop]], Tool!C$29:M$29,1,0)","v":"Baltosios garstyčios"}]
["Erosion fighter","Performance and role","Baltosios garstyčios","Very good",3,{"$f":"HLOOKUP(Table1[[#This Row],[Catch crop]], Tool!C$29:M$29,1,0)","v":"Baltosios garstyčios"}]
["Weed fighter","Performance and role","Baltosios garstyčios","Very good",3,{"$f":"HLOOKUP(Table1[[#This Row],[Catch crop]], Tool!C$29:M$29,1,0)","v":"Baltosios garstyčios"}]
["Good grazing","Performance and role","Baltosios garstyčios","Good",2,{"$f":"HLOOKUP(Table1[[#This Row],[Catch crop]], Tool!C$29:M$29,1,0)","v":"Baltosios garstyčios"}]
["Quick growth","Performance and role","Baltosios garstyčios","Very good",3,{"$f":"HLOOKUP(Table1[[#This Row],[Catch crop]], Tool!C$29:M$29,1,0)","v":"Baltosios garstyčios"}]
["Lasting residue","Performance and role","Baltosios garstyčios","Fair",1,{"$f":"HLOOKUP(Table1[[#This Row],[Catch crop]], Tool!C$29:M$29,1,0)","v":"Baltosios garstyčios"}]
["Length of vegetative stage","Performance and role","Baltosios garstyčios","Good",2,{"$f":"HLOOKUP(Table1[[#This Row],[Catch crop]], Tool!C$29:M$29,1,0)","v":"Baltosios garstyčios"}]
["Serving as a companion crop","Performance and role","Baltosios garstyčios","Poor",0,{"$f":"HLOOKUP(Table1[[#This Row],[Catch crop]], Tool!C$29:M$29,1,0)","v":"Baltosios garstyčios"}]
["Cold/frost resistance","Tolerances","Baltosios garstyčios","Poor",0,{"$f":"HLOOKUP(Table1[[#This Row],[Catch crop]], Tool!C$29:M$29,1,0)","v":"Baltosios garstyčios"}]
["Tolerance to heat","Tolerances","Baltosios garstyčios","Good",2,{"$f":"HLOOKUP(Table1[[#This Row],[Catch crop]], Tool!C$29:M$29,1,0)","v":"Baltosios garstyčios"}]
["Tolerance to drought","Tolerances","Baltosios garstyčios","Very good",3,{"$f":"HLOOKUP(Table1[[#This Row],[Catch crop]], Tool!C$29:M$29,1,0)","v":"Baltosios garstyčios"}]
["Tolerance to shade","Tolerances","Baltosios garstyčios","Good",2,{"$f":"HLOOKUP(Table1[[#This Row],[Catch crop]], Tool!C$29:M$29,1,0)","v":"Baltosios garstyčios"}]
["Tolerance to flood","Tolerances","Baltosios garstyčios","Fair",1,{"$f":"HLOOKUP(Table1[[#This Row],[Catch crop]], Tool!C$29:M$29,1,0)","v":"Baltosios garstyčios"}]
["Tolerance to low fertility","Tolerances","Baltosios garstyčios","Fair",1,{"$f":"HLOOKUP(Table1[[#This Row],[Catch crop]], Tool!C$29:M$29,1,0)","v":"Baltosios garstyčios"}]
["Min. germination temperature, C","Tolerances","Baltosios garstyčios",null,null,{"$f":"HLOOKUP(Table1[[#This Row],[Catch crop]], Tool!C$29:M$29,1,0)","v":"Baltosios garstyčios"}]
["Subsoiler","Potential advantages: soil impact","Baltosios garstyčios","Fair",1,{"$f":"HLOOKUP(Table1[[#This Row],[Catch crop]], Tool!C$29:M$29,1,0)","v":"Baltosios garstyčios"}]
["Free P and K","Potential advantages: soil impact","Baltosios garstyčios","Good",2,{"$f":"HLOOKUP(Table1[[#This Row],[Catch crop]], Tool!C$29:M$29,1,0)","v":"Baltosios garstyčios"}]
["Loosen topsoil","Potential advantages: soil impact","Baltosios garstyčios","Very good",3,{"$f":"HLOOKUP(Table1[[#This Row],[Catch crop]], Tool!C$29:M$29,1,0)","v":"Baltosios garstyčios"}]
["Nematodes","Potential advantages: soil ecology","Baltosios garstyčios","Very good",3,{"$f":"HLOOKUP(Table1[[#This Row],[Catch crop]], Tool!C$29:M$29,1,0)","v":"Baltosios garstyčios"}]
["Disease","Potential advantages: soil ecology","Baltosios garstyčios","Very good",3,{"$f":"HLOOKUP(Table1[[#This Row],[Catch crop]], Tool!C$29:M$29,1,0)","v":"Baltosios garstyčios"}]
["Allelopathic","Potential advantages: soil ecology","Baltosios garstyčios","Very good",3,{"$f":"HLOOKUP(Table1[[#This Row],[Catch crop]], Tool!C$29:M$29,1,0)","v":"Baltosios garstyčios"}]
["Choke weeds","Potential advantages: soil ecology","Baltosios garstyčios","Very good",3,{"$f":"HLOOKUP(Table1[[#This Row],[Catch crop]], Tool!C$29:M$29,1,0)","v":"Baltosios garstyčios"}]
["Attract beneficials","Potential advantages: other","Baltosios garstyčios","Good",2,{"$f":"HLOOKUP(Table1[[#This Row],[Catch crop]], Tool!C$29:M$29,1,0)","v":"Baltosios garstyčios"}]
["Bears traffic","Potential advantages: other","Baltosios garstyčios","Good",2,{"$f":"HLOOKUP(Table1[[#This Row],[Catch crop]], Tool!C$29:M$29,1,0)","v":"Baltosios garstyčios"}]
["Short windows","Potential advantages: other","Baltosios garstyčios","Very good",3,{"$f":"HLOOKUP(Table1[[#This Row],[Catch crop]], Tool!C$29:M$29,1,0)","v":"Baltosios garstyčios"}]
["Weed potential","Potential disadvantages: increase pest risks","Baltosios garstyčios","Could be a moderate problem",1,{"$f":"HLOOKUP(Table1[[#This Row],[Catch crop]], Tool!C$29:M$29,1,0)","v":"Baltosios garstyčios"}]
["Insects/ nematodes","Potential disadvantages: increase pest risks","Baltosios garstyčios","Occasionally a minor problem",3,{"$f":"HLOOKUP(Table1[[#This Row],[Catch crop]], Tool!C$29:M$29,1,0)","v":"Baltosios garstyčios"}]
["Crop disease","Potential disadvantages: increase pest risks","Baltosios garstyčios","Not a problem",4,{"$f":"HLOOKUP(Table1[[#This Row],[Catch crop]], Tool!C$29:M$29,1,0)","v":"Baltosios garstyčios"}]
["Hinder crops","Potential disadvantages: management challenges","Baltosios garstyčios","Could be a minor problem",2,{"$f":"HLOOKUP(Table1[[#This Row],[Catch crop]], Tool!C$29:M$29,1,0)","v":"Baltosios garstyčios"}]
["Establishing","Potential disadvantages: management challenges","Baltosios garstyčios","Not a problem",4,{"$f":"HLOOKUP(Table1[[#This Row],[Catch crop]], Tool!C$29:M$29,1,0)","v":"Baltosios garstyčios"}]
["Killing by tillage","Potential disadvantages: management challenges","Baltosios garstyčios","Not a problem",4,{"$f":"HLOOKUP(Table1[[#This Row],[Catch crop]], Tool!C$29:M$29,1,0)","v":"Baltosios garstyčios"}]
["Killing by mow","Potential disadvantages: management challenges","Baltosios garstyčios","Could be a moderate problem",1,{"$f":"HLOOKUP(Table1[[#This Row],[Catch crop]], Tool!C$29:M$29,1,0)","v":"Baltosios garstyčios"}]
["Incorporation of mature stand","Potential disadvantages: management challenges","Baltosios garstyčios","Not a problem",4,{"$f":"HLOOKUP(Table1[[#This Row],[Catch crop]], Tool!C$29:M$29,1,0)","v":"Baltosios garstyčios"}]
["Store excess N","Performance and role","Brown mustrard","Very good",3,{"$f":"HLOOKUP(Table1[[#This Row],[Catch crop]], Tool!C$29:M$29,1,0)","v":{"$error":"#N/A"}}]
["Organic matter improvement","Performance and role","Brown mustrard","Very good",3,{"$f":"HLOOKUP(Table1[[#This Row],[Catch crop]], Tool!C$29:M$29,1,0)","v":{"$error":"#N/A"}}]
["Erosion fighter","Performance and role","Brown mustrard","Very good",3,{"$f":"HLOOKUP(Table1[[#This Row],[Catch crop]], Tool!C$29:M$29,1,0)","v":{"$error":"#N/A"}}]
["Weed fighter","Performance and role","Brown mustrard","Very good",3,{"$f":"HLOOKUP(Table1[[#This Row],[Catch crop]], Tool!C$29:M$29,1,0)","v":{"$error":"#N/A"}}]
["Good grazing","Performance and role","Brown mustrard","Fair",1,{"$f":"HLOOKUP(Table1[[#This Row],[Catch crop]], Tool!C$29:M$29,1,0)","v":{"$error":"#N/A"}}]
["Quick growth","Performance and role","Brown mustrard","Good",2,{"$f":"HLOOKUP(Table1[[#This Row],[Catch crop]], Tool!C$29:M$29,1,0)","v":{"$error":"#N/A"}}]
["Lasting residue","Performance and role","Brown mustrard","Fair",1,{"$f":"HLOOKUP(Table1[[#This Row],[Catch crop]], Tool!C$29:M$29,1,0)","v":{"$error":"#N/A"}}]
["Length of vegetative stage","Performance and role","Brown mustrard","Good",2,{"$f":"HLOOKUP(Table1[[#This Row],[Catch crop]], Tool!C$29:M$29,1,0)","v":{"$error":"#N/A"}}]
["Serving as a companion crop","Performance and role","Brown mustrard","Poor",0,{"$f":"HLOOKUP(Table1[[#This Row],[Catch crop]], Tool!C$29:M$29,1,0)","v":{"$error":"#N/A"}}]
["Cold/frost resistance","Tolerances","Brown mustrard","Poor",0,{"$f":"HLOOKUP(Table1[[#This Row],[Catch crop]], Tool!C$29:M$29,1,0)","v":{"$error":"#N/A"}}]
["Tolerance to heat","Tolerances","Brown mustrard","Very good",3,{"$f":"HLOOKUP(Table1[[#This Row],[Catch crop]], Tool!C$29:M$29,1,0)","v":{"$error":"#N/A"}}]
["Tolerance to drought","Tolerances","Brown mustrard","Excellent",4,{"$f":"HLOOKUP(Table1[[#This Row],[Catch crop]], Tool!C$29:M$29,1,0)","v":{"$error":"#N/A"}}]
["Tolerance to shade","Tolerances","Brown mustrard","Good",2,{"$f":"HLOOKUP(Table1[[#This Row],[Catch crop]], Tool!C$29:M$29,1,0)","v":{"$error":"#N/A"}}]
["Tolerance to flood","Tolerances","Brown mustrard","Fair",1,{"$f":"HLOOKUP(Table1[[#This Row],[Catch crop]], Tool!C$29:M$29,1,0)","v":{"$error":"#N/A"}}]
["Tolerance to low fertility","Tolerances","Brown mustrard","Fair",1,{"$f":"HLOOKUP(Table1[[#This Row],[Catch crop]], Tool!C$29:M$29,1,0)","v":{"$error":"#N/A"}}]
["Min. germination temperature, C","Tolerances","Brown mustrard",null,null,{"$f":"HLOOKUP(Table1[[#This Row],[Catch crop]], Tool!C$29:M$29,1,0)","v":{"$error":"#N/A"}}]
["Subsoiler","Potential advantages: soil impact","Brown mustrard","Very good",3,{"$f":"HLOOKUP(Table1[[#This Row],[Catch crop]], Tool!C$29:M$29,1,0)","v":{"$error":"#N/A"}}]
["Free P and K","Potential advantages: soil impact","Brown mustrard","Good",2,{"$f":"HLOOKUP(Table1[[#This Row],[Catch crop]], Tool!C$29:M$29,1,0)","v":{"$error":"#N/A"}}]
["Loosen topsoil","Potential advantages: soil impact","Brown mustrard","Very good",3,{"$f":"HLOOKUP(Table1[[#This Row],[Catch crop]], Tool!C$29:M$29,1,0)","v":{"$error":"#N/A"}}]
["Nematodes","Potential advantages: soil ecology","Brown mustrard","Very good",3,{"$f":"HLOOKUP(Table1[[#This Row],[Catch crop]], Tool!C$29:M$29,1,0)","v":{"$error":"#N/A"}}]
["Disease","Potential advantages: soil ecology","Brown mustrard","Excellent",4,{"$f":"HLOOKUP(Table1[[#This Row],[Catch crop]], Tool!C$29:M$29,1,0)","v":{"$error":"#N/A"}}]
["Allelopathic","Potential advantages: soil ecology","Brown mustrard","Very good",3,{"$f":"HLOOKUP(Table1[[#This Row],[Catch crop]], Tool!C$29:M$29,1,0)","v":{"$error":"#N/A"}}]
["Choke weeds","Potential advantages: soil ecology","Brown mustrard","Very good",3,{"$f":"HLOOKUP(Table1[[#This Row],[Catch crop]], Tool!C$29:M$29,1,0)","v":{"$error":"#N/A"}}]
["Attract beneficials","Potential advantages: other","Brown mustrard","Good",2,{"$f":"HLOOKUP(Table1[[#This Row],[Catch crop]], Tool!C$29:M$29,1,0)","v":{"$error":"#N/A"}}]
["Bears traffic","Potential advantages: other","Brown mustrard","Good",2,{"$f":"HLOOKUP(Table1[[#This Row],[Catch crop]], Tool!C$29:M$29,1,0)","v":{"$error":"#N/A"}}]
["Short windows","Potential advantages: other","Brown mustrard","Very good",3,{"$f":"HLOOKUP(Table1[[#This Row],[Catch crop]], Tool!C$29:M$29,1,0)","v":{"$error":"#N/A"}}]
["Weed potential","Potential disadvantages: increase pest risks","Brown mustrard","Could be a moderate problem",1,{"$f":"HLOOKUP(Table1[[#This Row],[Catch crop]], Tool!C$29:M$29,1,0)","v":{"$error":"#N/A"}}]
["Insects/ nematodes","Potential disadvantages: increase pest risks","Brown mustrard","Occasionally a minor problem",3,{"$f":"HLOOKUP(Table1[[#This Row],[Catch crop]], Tool!C$29:M$29,1,0)","v":{"$error":"#N/A"}}]
["Crop disease","Potential disadvantages: increase pest risks","Brown mustrard","Not a problem",4,{"$f":"HLOOKUP(Table1[[#This Row],[Catch crop]], Tool!C$29:M$29,1,0)","v":{"$error":"#N/A"}}]
["Hinder crops","Potential disadvantages: management challenges","Brown mustrard","Could be a minor problem",2,{"$f":"HLOOKUP(Table1[[#This Row],[Catch crop]], Tool!C$29:M$29,1,0)","v":{"$error":"#N/A"}}]
["Establishing","Potential disadvantages: management challenges","Brown mustrard","Not a problem",4,{"$f":"HLOOKUP(Table1[[#This Row],[Catch crop]], Tool!C$29:M$29,1,0)","v":{"$error":"#N/A"}}]
["Killing by tillage","Potential disadvantages: management challenges","Brown mustrard","Not a problem",4,{"$f":"HLOOKUP(Table1[[#This Row],[Catch crop]], Tool!C$29:M$29,1,0)","v":{"$error":"#N/A"}}]
["Killing by mow","Potential disadvantages: management challenges","Brown mustrard","Could be a moderate problem",1,{"$f":"HLOOKUP(Table1[[#This Row],[Catch crop]], Tool!C$29:M$29,1,0)","v":{"$error":"#N/A"}}]
["Incorporation of mature stand","Potential disadvantages: management challenges","Brown mustrard","Not a problem",4,{"$f":"HLOOKUP(Table1[[#This Row],[Catch crop]], Tool!C$29:M$29,1,0)","v":{"$error":"#N/A"}}]
["Store excess N","Performance and role","Spring rape","Very good",3,{"$f":"HLOOKUP(Table1[[#This Row],[Catch crop]], Tool!C$29:M$29,1,0)","v":{"$error":"#N/A"}}]
["Organic matter improvement","Performance and role","Spring rape","Good",2,{"$f":"HLOOKUP(Table1[[#This Row],[Catch crop]], Tool!C$29:M$29,1,0)","v":{"$error":"#N/A"}}]
["Erosion fighter","Performance and role","Spring rape","Very good",3,{"$f":"HLOOKUP(Table1[[#This Row],[Catch crop]], Tool!C$29:M$29,1,0)","v":{"$error":"#N/A"}}]
["Weed fighter","Performance and role","Spring rape","Very good",3,{"$f":"HLOOKUP(Table1[[#This Row],[Catch crop]], Tool!C$29:M$29,1,0)","v":{"$error":"#N/A"}}]
["Good grazing","Performance and role","Spring rape","Good",2,{"$f":"HLOOKUP(Table1[[#This Row],[Catch crop]], Tool!C$29:M$29,1,0)","v":{"$error":"#N/A"}}]
["Quick growth","Performance and role","Spring rape","Very good",3,{"$f":"HLOOKUP(Table1[[#This Row],[Catch crop]], Tool!C$29:M$29,1,0)","v":{"$error":"#N/A"}}]
["Lasting residue","Performance and role","Spring rape","Good",2,{"$f":"HLOOKUP(Table1[[#This Row],[Catch crop]], Tool!C$29:M$29,1,0)","v":{"$error":"#N/A"}}]
["Length of vegetative stage","Performance and role","Spring rape","Very good",3,{"$f":"HLOOKUP(Table1[[#This Row],[Catch crop]], Tool!C$29:M$29,1,0)","v":{"$error":"#N/A"}}]
["Serving as a companion crop","Performance and role","Spring rape","Poor",0,{"$f":"HLOOKUP(Table1[[#This Row],[Catch crop]], Tool!C$29:M$29,1,0)","v":{"$error":"#N/A"}}]
["Cold/frost resistance","Tolerances","Spring rape","Fair",1,{"$f":"HLOOKUP(Table1[[#This Row],[Catch crop]], Tool!C$29:M$29,1,0)","v":{"$error":"#N/A"}}]
["Tolerance to heat","Tolerances","Spring rape","Fair",1,{"$f":"HLOOKUP(Table1[[#This Row],[Catch crop]], Tool!C$29:M$29,1,0)","v":{"$error":"#N/A"}}]
["Tolerance to drought","Tolerances","Spring rape","Good",2,{"$f":"HLOOKUP(Table1[[#This Row],[Catch crop]], Tool!C$29:M$29,1,0)","v":{"$error":"#N/A"}}]
["Tolerance to shade","Tolerances","Spring rape","Good",2,{"$f":"HLOOKUP(Table1[[#This Row],[Catch crop]], Tool!C$29:M$29,1,0)","v":{"$error":"#N/A"}}]
["Tolerance to flood","Tolerances","Spring rape","Fair",1,{"$f":"HLOOKUP(Table1[[#This Row],[Catch crop]], Tool!C$29:M$29,1,0)","v":{"$error":"#N/A"}}]
["Tolerance to low fertility","Tolerances","Spring rape","Very good",3,{"$f":"HLOOKUP(Table1[[#This Row],[Catch crop]], Tool!C$29:M$29,1,0)","v":{"$error":"#N/A"}}]
["Min. germination temperature, C","Tolerances","Spring rape",null,null,{"$f":"HLOOKUP(Table1[[#This Row],[Catch crop]], Tool!C$29:M$29,1,0)","v":{"$error":"#N/A"}}]
["Subsoiler","Potential advantages: soil impact","Spring rape","Good",2,{"$f":"HLOOKUP(Table1[[#This Row],[Catch crop]], Tool!C$29:M$29,1,0)","v":{"$error":"#N/A"}}]
["Free P and K","Potential advantages: soil impact","Spring rape","Fair",1,{"$f":"HLOOKUP(Table1[[#This Row],[Catch crop]], Tool!C$29:M$29,1,0)","v":{"$error":"#N/A"}}]
["Loosen topsoil","Potential advantages: soil impact","Spring rape","Good",2,{"$f":"HLOOKUP(Table1[[#This Row],[Catch crop]], Tool!C$29:M$29,1,0)","v":{"$error":"#N/A"}}]
["Nematodes","Potential advantages: soil ecology","Spring rape","Very good",3,{"$f":"HLOOKUP(Table1[[#This Row],[Catch crop]], Tool!C$29:M$29,1,0)","v":{"$error":"#N/A"}}]
["Disease","Potential advantages: soil ecology","Spring rape","Good",2,{"$f":"HLOOKUP(Table1[[#This Row],[Catch crop]], Tool!C$29:M$29,1,0)","v":{"$error":"#N/A"}}]
["Allelopathic","Potential advantages: soil ecology","Spring rape","Very good",3,{"$f":"HLOOKUP(Table1[[#This Row],[Catch crop]], Tool!C$29:M$29,1,0)","v":{"$error":"#N/A"}}]
["Choke weeds","Potential advantages: soil ecology","Spring rape","Very good",3,{"$f":"HLOOKUP(Table1[[#This Row],[Catch crop]], Tool!C$29:M$29,1,0)","v":{"$error":"#N/A"}}]
["Attract beneficials","Potential advantages: other","Spring rape","Good",2,{"$f":"HLOOKUP(Table1[[#This Row],[Catch crop]], Tool!C$29:M$29,1,0)","v":{"$error":"#N/A"}}]
["Bears traffic","Potential advantages: other","Spring rape","Fair",1,{"$f":"HLOOKUP(Table1[[#This Row],[Catch crop]], Tool!C$29:M$29,1,0)","v":{"$error":"#N/A"}}]
["Short windows","Potential advantages: other","Spring rape","Good",2,{"$f":"HLOOKUP(Table1[[#This Row],[Catch crop]], Tool!C$29:M$29,1,0)","v":{"$error":"#N/A"}}]
["Weed potential","Potential disadvantages: increase pest risks","Spring rape","Could be a moderate problem",1,{"$f":"HLOOKUP(Table1[[#This Row],[Catch crop]], Tool!C$29:M$29,1,0)","v":{"$error":"#N/A"}}]
["Insects/ nematodes","Potential disadvantages: increase pest risks","Spring rape","Could be a moderate problem",1,{"$f":"HLOOKUP(Table1[[#This Row],[Catch crop]], Tool!C$29:M$29,1,0)","v":{"$error":"#N/A"}}]
["Crop disease","Potential disadvantages: increase pest risks","Spring rape","Not a problem",4,{"$f":"HLOOKUP(Table1[[#This Row],[Catch crop]], Tool!C$29:M$29,1,0)","v":{"$error":"#N/A"}}]
["Hinder crops","Potential disadvantages: management challenges","Spring rape","Could be a minor problem",2,{"$f":"HLOOKUP(Table1[[#This Row],[Catch crop]], Tool!C$29:M$29,1,0)","v":{"$error":"#N/A"}}]
["Establishing","Potential disadvantages: management challenges","Spring rape","Not a problem",4,{"$f":"HLOOKUP(Table1[[#This Row],[Catch crop]], Tool!C$29:M$29,1,0)","v":{"$error":"#N/A"}}]
["Killing by tillage","Potential disadvantages: management challenges","Spring rape","Could be a minor problem",2,{"$f":"HLOOKUP(Table1[[#This Row],[Catch crop]], Tool!C$29:M$29,1,0)","v":{"$error":"#N/A"}}]
["Killing by mow","Potential disadvantages: management challenges","Spring rape","Could be a moderate problem",1,{"$f":"HLOOKUP(Table1[[#This Row],[Catch crop]], Tool!C$29:M$29,1,0)","v":{"$error":"#N/A"}}]
["Incorporation of mature stand","Potential disadvantages: management challenges","Spring rape","Occasionally a minor problem",3,{"$f":"HLOOKUP(Table1[[#This Row],[Catch crop]], Tool!C$29:M$29,1,0)","v":{"$error":"#N/A"}}]
["Store excess N","Performance and role","Winter rape","Very good",3,{"$f":"HLOOKUP(Table1[[#This Row],[Catch crop]], Tool!C$29:M$29,1,0)","v":{"$error":"#N/A"}}]
["Organic matter improvement","Performance and role","Winter rape","Good",2,{"$f":"HLOOKUP(Table1[[#This Row],[Catch crop]], Tool!C$29:M$29,1,0)","v":{"$error":"#N/A"}}]
["Erosion fighter","Performance and role","Winter rape","Very good",3,{"$f":"HLOOKUP(Table1[[#This Row],[Catch crop]], Tool!C$29:M$29,1,0)","v":{"$error":"#N/A"}}]
["Weed fighter","Performance and role","Winter rape","Very good",3,{"$f":"HLOOKUP(Table1[[#This Row],[Catch crop]], Tool!C$29:M$29,1,0)","v":{"$error":"#N/A"}}]
["Good grazing","Performance and role","Winter rape","Good",2,{"$f":"HLOOKUP(Table1[[#This Row],[Catch crop]], Tool!C$29:M$29,1,0)","v":{"$error":"#N/A"}}]
["Quick growth","Performance and role","Winter rape","Very good",3,{"$f":"HLOOKUP(Table1[[#This Row],[Catch crop]], Tool!C$29:M$29,1,0)","v":{"$error":"#N/A"}}]
["Lasting residue","Performance and role","Winter rape","Good",2,{"$f":"HLOOKUP(Table1[[#This Row],[Catch crop]], Tool!C$29:M$29,1,0)","v":{"$error":"#N/A"}}]
["Length of vegetative stage","Performance and role","Winter rape","Very good",3,{"$f":"HLOOKUP(Table1[[#This Row],[Catch crop]], Tool!C$29:M$29,1,0)","v":{"$error":"#N/A"}}]
["Serving as a companion crop","Performance and role","Winter rape","Poor",0,{"$f":"HLOOKUP(Table1[[#This Row],[Catch crop]], Tool!C$29:M$29,1,0)","v":{"$error":"#N/A"}}]
["Cold/frost resistance","Tolerances","Winter rape","Excellent",4,{"$f":"HLOOKUP(Table1[[#This Row],[Catch crop]], Tool!C$29:M$29,1,0)","v":{"$error":"#N/A"}}]
["Tolerance to heat","Tolerances","Winter rape","Fair",1,{"$f":"HLOOKUP(Table1[[#This Row],[Catch crop]], Tool!C$29:M$29,1,0)","v":{"$error":"#N/A"}}]
["Tolerance to drought","Tolerances","Winter rape","Good",2,{"$f":"HLOOKUP(Table1[[#This Row],[Catch crop]], Tool!C$29:M$29,1,0)","v":{"$error":"#N/A"}}]
["Tolerance to shade","Tolerances","Winter rape","Good",2,{"$f":"HLOOKUP(Table1[[#This Row],[Catch crop]], Tool!C$29:M$29,1,0)","v":{"$error":"#N/A"}}]
["Tolerance to flood","Tolerances","Winter rape","Fair",1,{"$f":"HLOOKUP(Table1[[#This Row],[Catch crop]], Tool!C$29:M$29,1,0)","v":{"$error":"#N/A"}}]
["Tolerance to low fertility","Tolerances","Winter rape","Fair",1,{"$f":"HLOOKUP(Table1[[#This Row],[Catch crop]], Tool!C$29:M$29,1,0)","v":{"$error":"#N/A"}}]
["Min. germination temperature, C","Tolerances","Winter rape",null,5,{"$f":"HLOOKUP(Table1[[#This Row],[Catch crop]], Tool!C$29:M$29,1,0)","v":{"$error":"#N/A"}}]
["Subsoiler","Potential advantages: soil impact","Winter rape","Very good",3,{"$f":"HLOOKUP(Table1[[#This Row],[Catch crop]], Tool!C$29:M$29,1,0)","v":{"$error":"#N/A"}}]
["Free P and K","Potential advantages: soil impact","Winter rape","Fair",1,{"$f":"HLOOKUP(Table1[[#This Row],[Catch crop]], Tool!C$29:M$29,1,0)","v":{"$error":"#N/A"}}]
["Loosen topsoil","Potential advantages: soil impact","Winter rape","Good",2,{"$f":"HLOOKUP(Table1[[#This Row],[Catch crop]], Tool!C$29:M$29,1,0)","v":{"$error":"#N/A"}}]
["Nematodes","Potential advantages: soil ecology","Winter rape","Very good",3,{"$f":"HLOOKUP(Table1[[#This Row],[Catch crop]], Tool!C$29:M$29,1,0)","v":{"$error":"#N/A"}}]
["Disease","Potential advantages: soil ecology","Winter rape","Good",2,{"$f":"HLOOKUP(Table1[[#This Row],[Catch crop]], Tool!C$29:M$29,1,0)","v":{"$error":"#N/A"}}]
["Allelopathic","Potential advantages: soil ecology","Winter rape","Very good",3,{"$f":"HLOOKUP(Table1[[#This Row],[Catch crop]], Tool!C$29:M$29,1,0)","v":{"$error":"#N/A"}}]
["Choke weeds","Potential advantages: soil ecology","Winter rape","Good",2,{"$f":"HLOOKUP(Table1[[#This Row],[Catch crop]], Tool!C$29:M$29,1,0)","v":{"$error":"#N/A"}}]
["Attract beneficials","Potential advantages: other","Winter rape","Good",2,{"$f":"HLOOKUP(Table1[[#This Row],[Catch crop]], Tool!C$29:M$29,1,0)","v":{"$error":"#N/A"}}]
["Bears traffic","Potential advantages: other","Winter rape","Fair",1,{"$f":"HLOOKUP(Table1[[#This Row],[Catch crop]], Tool!C$29:M$29,1,0)","v":{"$error":"#N/A"}}]
["Short windows","Potential advantages: other","Winter rape","Good",2,{"$f":"HLOOKUP(Table1[[#This Row],[Catch crop]], Tool!C$29:M$29,1,0)","v":{"$error":"#N/A"}}]
["Weed potential","Potential disadvantages: increase pest risks","Winter rape","Could be a moderate problem",1,{"$f":"HLOOKUP(Table1[[#This Row],[Catch crop]], Tool!C$29:M$29,1,0)","v":{"$error":"#N/A"}}]
["Insects/ nematodes","Potential disadvantages: increase pest risks","Winter rape","Could be a moderate problem",1,{"$f":"HLOOKUP(Table1[[#This Row],[Catch crop]], Tool!C$29:M$29,1,0)","v":{"$error":"#N/A"}}]
["Crop disease","Potential disadvantages: increase pest risks","Winter rape","Not a problem",4,{"$f":"HLOOKUP(Table1[[#This Row],[Catch crop]], Tool!C$29:M$29,1,0)","v":{"$error":"#N/A"}}]
["Hinder crops","Potential disadvantages: management challenges","Winter rape","Could be a minor problem",2,{"$f":"HLOOKUP(Table1[[#This Row],[Catch crop]], Tool!C$29:M$29,1,0)","v":{"$error":"#N/A"}}]
["Establishing","Potential disadvantages: management challenges","Winter rape","Not a problem",4,{"$f":"HLOOKUP(Table1[[#This Row],[Catch crop]], Tool!C$29:M$29,1,0)","v":{"$error":"#N/A"}}]
["Killing by tillage","Potential disadvantages: management challenges","Winter rape","Could be a minor problem",2,{"$f":"HLOOKUP(Table1[[#This Row],[Catch crop]], Tool!C$29:M$29,1,0)","v":{"$error":"#N/A"}}]
["Killing by mow","Potential disadvantages: management challenges","Winter rape","Could be a moderate problem",1,{"$f":"HLOOKUP(Table1[[#This Row],[Catch crop]], Tool!C$29:M$29,1,0)","v":{"$error":"#N/A"}}]
["Incorporation of mature stand","Potential disadvantages: management challenges","Winter rape","Occasionally a minor problem",3,{"$f":"HLOOKUP(Table1[[#This Row],[Catch crop]], Tool!C$29:M$29,1,0)","v":{"$error":"#N/A"}}]
["Store excess N","Performance and role","Oil (forage) radish","Excellent",4,{"$f":"HLOOKUP(Table1[[#This Row],[Catch crop]], Tool!C$29:M$29,1,0)","v":{"$error":"#N/A"}}]
["Organic matter improvement","Performance and role","Oil (forage) radish","Very good",3,{"$f":"HLOOKUP(Table1[[#This Row],[Catch crop]], Tool!C$29:M$29,1,0)","v":{"$error":"#N/A"}}]
["Erosion fighter","Performance and role","Oil (forage) radish","Very good",3,{"$f":"HLOOKUP(Table1[[#This Row],[Catch crop]], Tool!C$29:M$29,1,0)","v":{"$error":"#N/A"}}]
["Weed fighter","Performance and role","Oil (forage) radish","Excellent",4,{"$f":"HLOOKUP(Table1[[#This Row],[Catch crop]], Tool!C$29:M$29,1,0)","v":{"$error":"#N/A"}}]
["Good grazing","Performance and role","Oil (forage) radish","Good",2,{"$f":"HLOOKUP(Table1[[#This Row],[Catch crop]], Tool!C$29:M$29,1,0)","v":{"$error":"#N/A"}}]
["Quick growth","Performance and role","Oil (forage) radish","Very good",3,{"$f":"HLOOKUP(Table1[[#This Row],[Catch crop]], Tool!C$29:M$29,1,0)","v":{"$error":"#N/A"}}]
["Lasting residue","Performance and role","Oil (forage) radish","Fair",1,{"$f":"HLOOKUP(Table1[[#This Row],[Catch crop]], Tool!C$29:M$29,1,0)","v":{"$error":"#N/A"}}]
["Length of vegetative stage","Performance and role","Oil (forage) radish","Good",2,{"$f":"HLOOKUP(Table1[[#This Row],[Catch crop]], Tool!C$29:M$29,1,0)","v":{"$error":"#N/A"}}]
["Serving as a companion crop","Performance and role","Oil (forage) radish","Fair",1,{"$f":"HLOOKUP(Table1[[#This Row],[Catch crop]], Tool!C$29:M$29,1,0)","v":{"$error":"#N/A"}}]
["Cold/frost resistance","Tolerances","Oil (forage) radish","Good",2,{"$f":"HLOOKUP(Table1[[#This Row],[Catch crop]], Tool!C$29:M$29,1,0)","v":{"$error":"#N/A"}}]
["Tolerance to heat","Tolerances","Oil (forage) radish","Good",2,{"$f":"HLOOKUP(Table1[[#This Row],[Catch crop]], Tool!C$29:M$29,1,0)","v":{"$error":"#N/A"}}]
["Tolerance to drought","Tolerances","Oil (forage) radish","Fair",1,{"$f":"HLOOKUP(Table1[[#This Row],[Catch crop]], Tool!C$29:M$29,1,0)","v":{"$error":"#N/A"}}]
["Tolerance to shade","Tolerances","Oil (forage) radish","Good",2,{"$f":"HLOOKUP(Table1[[#This Row],[Catch crop]], Tool!C$29:M$29,1,0)","v":{"$error":"#N/A"}}]
["Tolerance to flood","Tolerances","Oil (forage) radish","Fair",1,{"$f":"HLOOKUP(Table1[[#This Row],[Catch crop]], Tool!C$29:M$29,1,0)","v":{"$error":"#N/A"}}]
["Tolerance to low fertility","Tolerances","Oil (forage) radish","Fair",1,{"$f":"HLOOKUP(Table1[[#This Row],[Catch crop]], Tool!C$29:M$29,1,0)","v":{"$error":"#N/A"}}]
["Min. germination temperature, C","Tolerances","Oil (forage) radish",null,7.2,{"$f":"HLOOKUP(Table1[[#This Row],[Catch crop]], Tool!C$29:M$29,1,0)","v":{"$error":"#N/A"}}]
["Subsoiler","Potential advantages: soil impact","Oil (forage) radish","Excellent",4,{"$f":"HLOOKUP(Table1[[#This Row],[Catch crop]], Tool!C$29:M$29,1,0)","v":{"$error":"#N/A"}}]
["Free P and K","Potential advantages: soil impact","Oil (forage) radish","Very good",3,{"$f":"HLOOKUP(Table1[[#This Row],[Catch crop]], Tool!C$29:M$29,1,0)","v":{"$error":"#N/A"}}]
["Loosen topsoil","Potential advantages: soil impact","Oil (forage) radish","Good",2,{"$f":"HLOOKUP(Table1[[#This Row],[Catch crop]], Tool!C$29:M$29,1,0)","v":{"$error":"#N/A"}}]
["Nematodes","Potential advantages: soil ecology","Oil (forage) radish","Very good",3,{"$f":"HLOOKUP(Table1[[#This Row],[Catch crop]], Tool!C$29:M$29,1,0)","v":{"$error":"#N/A"}}]
["Disease","Potential advantages: soil ecology","Oil (forage) radish","Good",2,{"$f":"HLOOKUP(Table1[[#This Row],[Catch crop]], Tool!C$29:M$29,1,0)","v":{"$error":"#N/A"}}]
["Allelopathic","Potential advantages: soil ecology","Oil (forage) radish","Very good",3,{"$f":"HLOOKUP(Table1[[#This Row],[Catch crop]], Tool!C$29:M$29,1,0)","v":{"$error":"#N/A"}}]
["Choke weeds","Potential advantages: soil ecology","Oil (forage) radish","Excellent",4,{"$f":"HLOOKUP(Table1[[#This Row],[Catch crop]], Tool!C$29:M$29,1,0)","v":{"$error":"#N/A"}}]
["Attract beneficials","Potential advantages: other","Oil (forage) radish","Fair",1,{"$f":"HLOOKUP(Table1[[#This Row],[Catch crop]], Tool!C$29:M$29,1,0)","v":{"$error":"#N/A"}}]
["Bears traffic","Potential advantages: other","Oil (forage) radish","Fair",1,{"$f":"HLOOKUP(Table1[[#This Row],[Catch crop]], Tool!C$29:M$29,1,0)","v":{"$error":"#N/A"}}]
["Short windows","Potential advantages: other","Oil (forage) radish","Very good",3,{"$f":"HLOOKUP(Table1[[#This Row],[Catch crop]], Tool!C$29:M$29,1,0)","v":{"$error":"#N/A"}}]
["Weed potential","Potential disadvantages: increase pest risks","Oil (forage) radish","Could be a minor problem",2,{"$f":"HLOOKUP(Table1[[#This Row],[Catch crop]], Tool!C$29:M$29,1,0)","v":{"$error":"#N/A"}}]
["Insects/ nematodes","Potential disadvantages: increase pest risks","Oil (forage) radish","Occasionally a minor problem",3,{"$f":"HLOOKUP(Table1[[#This Row],[Catch crop]], Tool!C$29:M$29,1,0)","v":{"$error":"#N/A"}}]
["Crop disease","Potential disadvantages: increase pest risks","Oil (forage) radish","Not a problem",4,{"$f":"HLOOKUP(Table1[[#This Row],[Catch crop]], Tool!C$29:M$29,1,0)","v":{"$error":"#N/A"}}]
["Hinder crops","Potential disadvantages: management challenges","Oil (forage) radish","Not a problem",4,{"$f":"HLOOKUP(Table1[[#This Row],[Catch crop]], Tool!C$29:M$29,1,0)","v":{"$error":"#N/A"}}]
["Establishing","Potential disadvantages: management challenges","Oil (forage) radish","Not a problem",4,{"$f":"HLOOKUP(Table1[[#This Row],[Catch crop]], Tool!C$29:M$29,1,0)","v":{"$error":"#N/A"}}]
["Killing by tillage","Potential disadvantages: management challenges","Oil (forage) radish","Not a problem",4,{"$f":"HLOOKUP(Table1[[#This Row],[Catch crop]], Tool!C$29:M$29,1,0)","v":{"$error":"#N/A"}}]
["Killing by mow","Potential disadvantages: management challenges","Oil (forage) radish","Not a problem",4,{"$f":"HLOOKUP(Table1[[#This Row],[Catch crop]], Tool!C$29:M$29,1,0)","v":{"$error":"#N/A"}}]
["Incorporation of mature stand","Potential disadvantages: management challenges","Oil (forage) radish","Not a problem",4,{"$f":"HLOOKUP(Table1[[#This Row],[Catch crop]], Tool!C$29:M$29,1,0)","v":{"$error":"#N/A"}}]
["Store excess N","Performance and role","Root (tillage) radish","Excellent",4,{"$f":"HLOOKUP(Table1[[#This Row],[Catch crop]], Tool!C$29:M$29,1,0)","v":{"$error":"#N/A"}}]
["Organic matter improvement","Performance and role","Root (tillage) radish","Excellent",4,{"$f":"HLOOKUP(Table1[[#This Row],[Catch crop]], Tool!C$29:M$29,1,0)","v":{"$error":"#N/A"}}]
["Erosion fighter","Performance and role","Root (tillage) radish","Very good",3,{"$f":"HLOOKUP(Table1[[#This Row],[Catch crop]], Tool!C$29:M$29,1,0)","v":{"$error":"#N/A"}}]
["Weed fighter","Performance and role","Root (tillage) radish","Very good",3,{"$f":"HLOOKUP(Table1[[#This Row],[Catch crop]], Tool!C$29:M$29,1,0)","v":{"$error":"#N/A"}}]
["Good grazing","Performance and role","Root (tillage) radish","Very good",3,{"$f":"HLOOKUP(Table1[[#This Row],[Catch crop]], Tool!C$29:M$29,1,0)","v":{"$error":"#N/A"}}]
["Quick growth","Performance and role","Root (tillage) radish","Very good",3,{"$f":"HLOOKUP(Table1[[#This Row],[Catch crop]], Tool!C$29:M$29,1,0)","v":{"$error":"#N/A"}}]
["Lasting residue","Performance and role","Root (tillage) radish","Very good",3,{"$f":"HLOOKUP(Table1[[#This Row],[Catch crop]], Tool!C$29:M$29,1,0)","v":{"$error":"#N/A"}}]
["Length of vegetative stage","Performance and role","Root (tillage) radish","Good",2,{"$f":"HLOOKUP(Table1[[#This Row],[Catch crop]], Tool!C$29:M$29,1,0)","v":{"$error":"#N/A"}}]
["Serving as a companion crop","Performance and role","Root (tillage) radish","Excellent",4,{"$f":"HLOOKUP(Table1[[#This Row],[Catch crop]], Tool!C$29:M$29,1,0)","v":{"$error":"#N/A"}}]
["Cold/frost resistance","Tolerances","Root (tillage) radish","Fair",1,{"$f":"HLOOKUP(Table1[[#This Row],[Catch crop]], Tool!C$29:M$29,1,0)","v":{"$error":"#N/A"}}]
["Tolerance to heat","Tolerances","Root (tillage) radish","Good",2,{"$f":"HLOOKUP(Table1[[#This Row],[Catch crop]], Tool!C$29:M$29,1,0)","v":{"$error":"#N/A"}}]
["Tolerance to drought","Tolerances","Root (tillage) radish","Good",2,{"$f":"HLOOKUP(Table1[[#This Row],[Catch crop]], Tool!C$29:M$29,1,0)","v":{"$error":"#N/A"}}]
["Tolerance to shade","Tolerances","Root (tillage) radish","Good",2,{"$f":"HLOOKUP(Table1[[#This Row],[Catch crop]], Tool!C$29:M$29,1,0)","v":{"$error":"#N/A"}}]
["Tolerance to flood","Tolerances","Root (tillage) radish","Fair",1,{"$f":"HLOOKUP(Table1[[#This Row],[Catch crop]], Tool!C$29:M$29,1,0)","v":{"$error":"#N/A"}}]
["Tolerance to low fertility","Tolerances","Root (tillage) radish","Fair",1,{"$f":"HLOOKUP(Table1[[#This Row],[Catch crop]], Tool!C$29:M$29,1,0)","v":{"$error":"#N/A"}}]
["Min. germination temperature, C","Tolerances","Root (tillage) radish",null,null,{"$f":"HLOOKUP(Table1[[#This Row],[Catch crop]], Tool!C$29:M$29,1,0)","v":{"$error":"#N/A"}}]
["Subsoiler","Potential advantages: soil impact","Root (tillage) radish","Excellent",4,{"$f":"HLOOKUP(Table1[[#This Row],[Catch crop]], Tool!C$29:M$29,1,0)","v":{"$error":"#N/A"}}]
["Free P and K","Potential advantages: soil impact","Root (tillage) radish","Very good",3,{"$f":"HLOOKUP(Table1[[#This Row],[Catch crop]], Tool!C$29:M$29,1,0)","v":{"$error":"#N/A"}}]
["Loosen topsoil","Potential advantages: soil impact","Root (tillage) radish","Excellent",4,{"$f":"HLOOKUP(Table1[[#This Row],[Catch crop]], Tool!C$29:M$29,1,0)","v":{"$error":"#N/A"}}]
["Nematodes","Potential advantages: soil ecology","Root (tillage) radish","Very good",3,{"$f":"HLOOKUP(Table1[[#This Row],[Catch crop]], Tool!C$29:M$29,1,0)","v":{"$error":"#N/A"}}]
["Disease","Potential advantages: soil ecology","Root (tillage) radish","Good",2,{"$f":"HLOOKUP(Table1[[#This Row],[Catch crop]], Tool!C$29:M$29,1,0)","v":{"$error":"#N/A"}}]
["Allelopathic","Potential advantages: soil ecology","Root (tillage) radish","Very good",3,{"$f":"HLOOKUP(Table1[[#This Row],[Catch crop]], Tool!C$29:M$29,1,0)","v":{"$error":"#N/A"}}]
["Choke weeds","Potential advantages: soil ecology","Root (tillage) radish","Very good",3,{"$f":"HLOOKUP(Table1[[#This Row],[Catch crop]], Tool!C$29:M$29,1,0)","v":{"$error":"#N/A"}}]
["Attract beneficials","Potential advantages: other","Root (tillage) radish","Fair",1,{"$f":"HLOOKUP(Table1[[#This Row],[Catch crop]], Tool!C$29:M$29,1,0)","v":{"$error":"#N/A"}}]
["Bears traffic","Potential advantages: other","Root (tillage) radish","Fair",1,{"$f":"HLOOKUP(Table1[[#This Row],[Catch crop]], Tool!C$29:M$29,1,0)","v":{"$error":"#N/A"}}]
["Short windows","Potential advantages: other","Root (tillage) radish","Very good",3,{"$f":"HLOOKUP(Table1[[#This Row],[Catch crop]], Tool!C$29:M$29,1,0)","v":{"$error":"#N/A"}}]
["Weed potential","Potential disadvantages: increase pest risks","Root (tillage) radish","Could be a minor problem",2,{"$f":"HLOOKUP(Table1[[#This Row],[Catch crop]], Tool!C$29:M$29,1,0)","v":{"$error":"#N/A"}}]
["Insects/ nematodes","Potential disadvantages: increase pest risks","Root (tillage) radish","Occasionally a minor problem",3,{"$f":"HLOOKUP(Table1[[#This Row],[Catch crop]], Tool!C$29:M$29,1,0)","v":{"$error":"#N/A"}}]
["Crop disease","Potential disadvantages: increase pest risks","Root (tillage) radish","Not a problem",4,{"$f":"HLOOKUP(Table1[[#This Row],[Catch crop]], Tool!C$29:M$29,1,0)","v":{"$error":"#N/A"}}]
["Hinder crops","Potential disadvantages: management challenges","Root (tillage) radish","Not a problem",4,{"$f":"HLOOKUP(Table1[[#This Row],[Catch crop]], Tool!C$29:M$29,1,0)","v":{"$error":"#N/A"}}]
["Establishing","Potential disadvantages: management challenges","Root (tillage) radish","Not a problem",4,{"$f":"HLOOKUP(Table1[[#This Row],[Catch crop]], Tool!C$29:M$29,1,0)","v":{"$error":"#N/A"}}]
["Killing by tillage","Potential disadvantages: management challenges","Root (tillage) radish","Not a problem",4,{"$f":"HLOOKUP(Table1[[#This Row],[Catch crop]], Tool!C$29:M$29,1,0)","v":{"$error":"#N/A"}}]
["Killing by mow","Potential disadvantages: management challenges","Root (tillage) radish","Not a problem",4,{"$f":"HLOOKUP(Table1[[#This Row],[Catch crop]], Tool!C$29:M$29,1,0)","v":{"$error":"#N/A"}}]
["Incorporation of mature stand","Potential disadvantages: management challenges","Root (tillage) radish","Occasionally a minor problem",3,{"$f":"HLOOKUP(Table1[[#This Row],[Catch crop]], Tool!C$29:M$29,1,0)","v":{"$error":"#N/A"}}]
["Store excess N","Performance and role","Winter turnip rape","Excellent",4,{"$f":"HLOOKUP(Table1[[#This Row],[Catch crop]], Tool!C$29:M$29,1,0)","v":{"$error":"#N/A"}}]
["Organic matter improvement","Performance and role","Winter turnip rape","Very good",3,{"$f":"HLOOKUP(Table1[[#This Row],[Catch crop]], Tool!C$29:M$29,1,0)","v":{"$error":"#N/A"}}]
["Erosion fighter","Performance and role","Winter turnip rape","Excellent",4,{"$f":"HLOOKUP(Table1[[#This Row],[Catch crop]], Tool!C$29:M$29,1,0)","v":{"$error":"#N/A"}}]
["Weed fighter","Performance and role","Winter turnip rape","Very good",3,{"$f":"HLOOKUP(Table1[[#This Row],[Catch crop]], Tool!C$29:M$29,1,0)","v":{"$error":"#N/A"}}]
["Good grazing","Performance and role","Winter turnip rape","Excellent",4,{"$f":"HLOOKUP(Table1[[#This Row],[Catch crop]], Tool!C$29:M$29,1,0)","v":{"$error":"#N/A"}}]
["Quick growth","Performance and role","Winter turnip rape","Excellent",4,{"$f":"HLOOKUP(Table1[[#This Row],[Catch crop]], Tool!C$29:M$29,1,0)","v":{"$error":"#N/A"}}]
["Lasting residue","Performance and role","Winter turnip rape","Excellent",4,{"$f":"HLOOKUP(Table1[[#This Row],[Catch crop]], Tool!C$29:M$29,1,0)","v":{"$error":"#N/A"}}]
["Length of vegetative stage","Performance and role","Winter turnip rape","Very good",3,{"$f":"HLOOKUP(Table1[[#This Row],[Catch crop]], Tool!C$29:M$29,1,0)","v":{"$error":"#N/A"}}]
["Serving as a companion crop","Performance and role","Winter turnip rape","Fair",1,{"$f":"HLOOKUP(Table1[[#This Row],[Catch crop]], Tool!C$29:M$29,1,0)","v":{"$error":"#N/A"}}]
["Cold/frost resistance","Tolerances","Winter turnip rape","Good",2,{"$f":"HLOOKUP(Table1[[#This Row],[Catch crop]], Tool!C$29:M$29,1,0)","v":{"$error":"#N/A"}}]
["Tolerance to heat","Tolerances","Winter turnip rape","Fair",1,{"$f":"HLOOKUP(Table1[[#This Row],[Catch crop]], Tool!C$29:M$29,1,0)","v":{"$error":"#N/A"}}]
["Tolerance to drought","Tolerances","Winter turnip rape","Fair",1,{"$f":"HLOOKUP(Table1[[#This Row],[Catch crop]], Tool!C$29:M$29,1,0)","v":{"$error":"#N/A"}}]
["Tolerance to shade","Tolerances","Winter turnip rape","Good",2,{"$f":"HLOOKUP(Table1[[#This Row],[Catch crop]], Tool!C$29:M$29,1,0)","v":{"$error":"#N/A"}}]
["Tolerance to flood","Tolerances","Winter turnip rape","Fair",1,{"$f":"HLOOKUP(Table1[[#This Row],[Catch crop]], Tool!C$29:M$29,1,0)","v":{"$error":"#N/A"}}]
["Tolerance to low fertility","Tolerances","Winter turnip rape","Fair",1,{"$f":"HLOOKUP(Table1[[#This Row],[Catch crop]], Tool!C$29:M$29,1,0)","v":{"$error":"#N/A"}}]
["Min. germination temperature, C","Tolerances","Winter turnip rape",null,null,{"$f":"HLOOKUP(Table1[[#This Row],[Catch crop]], Tool!C$29:M$29,1,0)","v":{"$error":"#N/A"}}]
["Subsoiler","Potential advantages: soil impact","Winter turnip rape","Very good",3,{"$f":"HLOOKUP(Table1[[#This Row],[Catch crop]], Tool!C$29:M$29,1,0)","v":{"$error":"#N/A"}}]
["Free P and K","Potential advantages: soil impact","Winter turnip rape","Good",2,{"$f":"HLOOKUP(Table1[[#This Row],[Catch crop]], Tool!C$29:M$29,1,0)","v":{"$error":"#N/A"}}]
["Loosen topsoil","Potential advantages: soil impact","Winter turnip rape","Very good",3,{"$f":"HLOOKUP(Table1[[#This Row],[Catch crop]], Tool!C$29:M$29,1,0)","v":{"$error":"#N/A"}}]
["Nematodes","Potential advantages: soil ecology","Winter turnip rape","Very good",3,{"$f":"HLOOKUP(Table1[[#This Row],[Catch crop]], Tool!C$29:M$29,1,0)","v":{"$error":"#N/A"}}]
["Disease","Potential advantages: soil ecology","Winter turnip rape","Good",2,{"$f":"HLOOKUP(Table1[[#This Row],[Catch crop]], Tool!C$29:M$29,1,0)","v":{"$error":"#N/A"}}]
["Allelopathic","Potential advantages: soil ecology","Winter turnip rape","Very good",3,{"$f":"HLOOKUP(Table1[[#This Row],[Catch crop]], Tool!C$29:M$29,1,0)","v":{"$error":"#N/A"}}]
["Choke weeds","Potential advantages: soil ecology","Winter turnip rape","Very good",3,{"$f":"HLOOKUP(Table1[[#This Row],[Catch crop]], Tool!C$29:M$29,1,0)","v":{"$error":"#N/A"}}]
["Attract beneficials","Potential advantages: other","Winter turnip rape","Fair",1,{"$f":"HLOOKUP(Table1[[#This Row],[Catch crop]], Tool!C$29:M$29,1,0)","v":{"$error":"#N/A"}}]
["Bears traffic","Potential advantages: other","Winter turnip rape","Fair",1,{"$f":"HLOOKUP(Table1[[#This Row],[Catch crop]], Tool!C$29:M$29,1,0)","v":{"$error":"#N/A"}}]
["Short windows","Potential advantages: other","Winter turnip rape","Very good",3,{"$f":"HLOOKUP(Table1[[#This Row],[Catch crop]], Tool!C$29:M$29,1,0)","v":{"$error":"#N/A"}}]
["Weed potential","Potential disadvantages: increase pest risks","Winter turnip rape","Could be a minor problem",2,{"$f":"HLOOKUP(Table1[[#This Row],[Catch crop]], Tool!C$29:M$29,1,0)","v":{"$error":"#N/A"}}]
["Insects/ nematodes","Potential disadvantages: increase pest risks","Winter turnip rape","Not a problem",4,{"$f":"HLOOKUP(Table1[[#This Row],[Catch crop]], Tool!C$29:M$29,1,0)","v":{"$error":"#N/A"}}]
["Crop disease","Potential disadvantages: increase pest risks","Winter turnip rape","Not a problem",4,{"$f":"HLOOKUP(Table1[[#This Row],[Catch crop]], Tool!C$29:M$29,1,0)","v":{"$error":"#N/A"}}]
["Hinder crops","Potential disadvantages: management challenges","Winter turnip rape","Could be a minor problem",2,{"$f":"HLOOKUP(Table1[[#This Row],[Catch crop]], Tool!C$29:M$29,1,0)","v":{"$error":"#N/A"}}]
["Establishing","Potential disadvantages: management challenges","Winter turnip rape","Not a problem",4,{"$f":"HLOOKUP(Table1[[#This Row],[Catch crop]], Tool!C$29:M$29,1,0)","v":{"$error":"#N/A"}}]
["Killing by tillage","Potential disadvantages: management challenges","Winter turnip rape","Could be a minor problem",2,{"$f":"HLOOKUP(Table1[[#This Row],[Catch crop]], Tool!C$29:M$29,1,0)","v":{"$error":"#N/A"}}]
["Killing by mow","Potential disadvantages: management challenges","Winter turnip rape","Could be a moderate problem",1,{"$f":"HLOOKUP(Table1[[#This Row],[Catch crop]], Tool!C$29:M$29,1,0)","v":{"$error":"#N/A"}}]
["Incorporation of mature stand","Potential disadvantages: management challenges","Winter turnip rape","Occasionally a minor problem",3,{"$f":"HLOOKUP(Table1[[#This Row],[Catch crop]], Tool!C$29:M$29,1,0)","v":{"$error":"#N/A"}}]
["Store excess N","Performance and role","Winter rye","Excellent",4,{"$f":"HLOOKUP(Table1[[#This Row],[Catch crop]], Tool!C$29:M$29,1,0)","v":{"$error":"#N/A"}}]
["Organic matter improvement","Performance and role","Winter rye","Excellent",4,{"$f":"HLOOKUP(Table1[[#This Row],[Catch crop]], Tool!C$29:M$29,1,0)","v":{"$error":"#N/A"}}]
["Erosion fighter","Performance and role","Winter rye","Excellent",4,{"$f":"HLOOKUP(Table1[[#This Row],[Catch crop]], Tool!C$29:M$29,1,0)","v":{"$error":"#N/A"}}]
["Weed fighter","Performance and role","Winter rye","Excellent",4,{"$f":"HLOOKUP(Table1[[#This Row],[Catch crop]], Tool!C$29:M$29,1,0)","v":{"$error":"#N/A"}}]
["Good grazing","Performance and role","Winter rye","Good",2,{"$f":"HLOOKUP(Table1[[#This Row],[Catch crop]], Tool!C$29:M$29,1,0)","v":{"$error":"#N/A"}}]
["Quick growth","Performance and role","Winter rye","Excellent",4,{"$f":"HLOOKUP(Table1[[#This Row],[Catch crop]], Tool!C$29:M$29,1,0)","v":{"$error":"#N/A"}}]
["Lasting residue","Performance and role","Winter rye","Excellent",4,{"$f":"HLOOKUP(Table1[[#This Row],[Catch crop]], Tool!C$29:M$29,1,0)","v":{"$error":"#N/A"}}]
["Length of vegetative stage","Performance and role","Winter rye","Very good",3,{"$f":"HLOOKUP(Table1[[#This Row],[Catch crop]], Tool!C$29:M$29,1,0)","v":{"$error":"#N/A"}}]
["Serving as a companion crop","Performance and role","Winter rye","Very good",3,{"$f":"HLOOKUP(Table1[[#This Row],[Catch crop]], Tool!C$29:M$29,1,0)","v":{"$error":"#N/A"}}]
["Cold/frost resistance","Tolerances","Winter rye","Excellent",4,{"$f":"HLOOKUP(Table1[[#This Row],[Catch crop]], Tool!C$29:M$29,1,0)","v":{"$error":"#N/A"}}]
["Tolerance to heat","Tolerances","Winter rye","Good",2,{"$f":"HLOOKUP(Table1[[#This Row],[Catch crop]], Tool!C$29:M$29,1,0)","v":{"$error":"#N/A"}}]
["Tolerance to drought","Tolerances","Winter rye","Very good",3,{"$f":"HLOOKUP(Table1[[#This Row],[Catch crop]], Tool!C$29:M$29,1,0)","v":{"$error":"#N/A"}}]
["Tolerance to shade","Tolerances","Winter rye","Very good",3,{"$f":"HLOOKUP(Table1[[#This Row],[Catch crop]], Tool!C$29:M$29,1,0)","v":{"$error":"#N/A"}}]
["Tolerance to flood","Tolerances","Winter rye","Good",2,{"$f":"HLOOKUP(Table1[[#This Row],[Catch crop]], Tool!C$29:M$29,1,0)","v":{"$error":"#N/A"}}]
["Tolerance to low fertility","Tolerances","Winter rye","Excellent",4,{"$f":"HLOOKUP(Table1[[#This Row],[Catch crop]], Tool!C$29:M$29,1,0)","v":{"$error":"#N/A"}}]
["Min. germination temperature, C","Tolerances","Winter rye",null,1.1000000000000001,{"$f":"HLOOKUP(Table1[[#This Row],[Catch crop]], Tool!C$29:M$29,1,0)","v":{"$error":"#N/A"}}]
["Subsoiler","Potential advantages: soil impact","Winter rye","Fair",1,{"$f":"HLOOKUP(Table1[[#This Row],[Catch crop]], Tool!C$29:M$29,1,0)","v":{"$error":"#N/A"}}]
["Free P and K","Potential advantages: soil impact","Winter rye","Very good",3,{"$f":"HLOOKUP(Table1[[#This Row],[Catch crop]], Tool!C$29:M$29,1,0)","v":{"$error":"#N/A"}}]
["Loosen topsoil","Potential advantages: soil impact","Winter rye","Excellent",4,{"$f":"HLOOKUP(Table1[[#This Row],[Catch crop]], Tool!C$29:M$29,1,0)","v":{"$error":"#N/A"}}]
["Nematodes","Potential advantages: soil ecology","Winter rye","Good",2,{"$f":"HLOOKUP(Table1[[#This Row],[Catch crop]], Tool!C$29:M$29,1,0)","v":{"$error":"#N/A"}}]
["Disease","Potential advantages: soil ecology","Winter rye","Very good",3,{"$f":"HLOOKUP(Table1[[#This Row],[Catch crop]], Tool!C$29:M$29,1,0)","v":{"$error":"#N/A"}}]
["Allelopathic","Potential advantages: soil ecology","Winter rye","Excellent",4,{"$f":"HLOOKUP(Table1[[#This Row],[Catch crop]], Tool!C$29:M$29,1,0)","v":{"$error":"#N/A"}}]
["Choke weeds","Potential advantages: soil ecology","Winter rye","Excellent",4,{"$f":"HLOOKUP(Table1[[#This Row],[Catch crop]], Tool!C$29:M$29,1,0)","v":{"$error":"#N/A"}}]
["Attract beneficials","Potential advantages: other","Winter rye","Fair",1,{"$f":"HLOOKUP(Table1[[#This Row],[Catch crop]], Tool!C$29:M$29,1,0)","v":{"$error":"#N/A"}}]
["Bears traffic","Potential advantages: other","Winter rye","Very good",3,{"$f":"HLOOKUP(Table1[[#This Row],[Catch crop]], Tool!C$29:M$29,1,0)","v":{"$error":"#N/A"}}]
["Short windows","Potential advantages: other","Winter rye","Excellent",4,{"$f":"HLOOKUP(Table1[[#This Row],[Catch crop]], Tool!C$29:M$29,1,0)","v":{"$error":"#N/A"}}]
["Weed potential","Potential disadvantages: increase pest risks","Winter rye","Could be a moderate problem",1,{"$f":"HLOOKUP(Table1[[#This Row],[Catch crop]], Tool!C$29:M$29,1,0)","v":{"$error":"#N/A"}}]
["Insects/ nematodes","Potential disadvantages: increase pest risks","Winter rye","Could be a minor problem",2,{"$f":"HLOOKUP(Table1[[#This Row],[Catch crop]], Tool!C$29:M$29,1,0)","v":{"$error":"#N/A"}}]
["Crop disease","Potential disadvantages: increase pest risks","Winter rye","Occasionally a minor problem",3,{"$f":"HLOOKUP(Table1[[#This Row],[Catch crop]], Tool!C$29:M$29,1,0)","v":{"$error":"#N/A"}}]
["Hinder crops","Potential disadvantages: management challenges","Winter rye","Could be a moderate problem",1,{"$f":"HLOOKUP(Table1[[#This Row],[Catch crop]], Tool!C$29:M$29,1,0)","v":{"$error":"#N/A"}}]
["Establishing","Potential disadvantages: management challenges","Winter rye","Occasionally a minor problem",3,{"$f":"HLOOKUP(Table1[[#This Row],[Catch crop]], Tool!C$29:M$29,1,0)","v":{"$error":"#N/A"}}]
["Killing by tillage","Potential disadvantages: management challenges","Winter rye","Occasionally a minor problem",3,{"$f":"HLOOKUP(Table1[[#This Row],[Catch crop]], Tool!C$29:M$29,1,0)","v":{"$error":"#N/A"}}]
["Killing by mow","Potential disadvantages: management challenges","Winter rye","Not a problem",4,{"$f":"HLOOKUP(Table1[[#This Row],[Catch crop]], Tool!C$29:M$29,1,0)","v":{"$error":"#N/A"}}]
["Incorporation of mature stand","Potential disadvantages: management challenges","Winter rye","Problem",0,{"$f":"HLOOKUP(Table1[[#This Row],[Catch crop]], Tool!C$29:M$29,1,0)","v":{"$error":"#N/A"}}]
["Store excess N","Performance and role","White clover","Fair",1,{"$f":"HLOOKUP(Table1[[#This Row],[Catch crop]], Tool!C$29:M$29,1,0)","v":{"$error":"#N/A"}}]
["Organic matter improvement","Performance and role","White clover","Good",2,{"$f":"HLOOKUP(Table1[[#This Row],[Catch crop]], Tool!C$29:M$29,1,0)","v":{"$error":"#N/A"}}]
["Erosion fighter","Performance and role","White clover","Very good",3,{"$f":"HLOOKUP(Table1[[#This Row],[Catch crop]], Tool!C$29:M$29,1,0)","v":{"$error":"#N/A"}}]
["Weed fighter","Performance and role","White clover","Very good",3,{"$f":"HLOOKUP(Table1[[#This Row],[Catch crop]], Tool!C$29:M$29,1,0)","v":{"$error":"#N/A"}}]
["Good grazing","Performance and role","White clover","Excellent",4,{"$f":"HLOOKUP(Table1[[#This Row],[Catch crop]], Tool!C$29:M$29,1,0)","v":{"$error":"#N/A"}}]
["Quick growth","Performance and role","White clover","Fair",1,{"$f":"HLOOKUP(Table1[[#This Row],[Catch crop]], Tool!C$29:M$29,1,0)","v":{"$error":"#N/A"}}]
["Lasting residue","Performance and role","White clover","Fair",1,{"$f":"HLOOKUP(Table1[[#This Row],[Catch crop]], Tool!C$29:M$29,1,0)","v":{"$error":"#N/A"}}]
["Length of vegetative stage","Performance and role","White clover","Excellent",4,{"$f":"HLOOKUP(Table1[[#This Row],[Catch crop]], Tool!C$29:M$29,1,0)","v":{"$error":"#N/A"}}]
["Serving as a companion crop","Performance and role","White clover","Very good",3,{"$f":"HLOOKUP(Table1[[#This Row],[Catch crop]], Tool!C$29:M$29,1,0)","v":{"$error":"#N/A"}}]
["Cold/frost resistance","Tolerances","White clover","Excellent",4,{"$f":"HLOOKUP(Table1[[#This Row],[Catch crop]], Tool!C$29:M$29,1,0)","v":{"$error":"#N/A"}}]
["Tolerance to heat","Tolerances","White clover","Good",2,{"$f":"HLOOKUP(Table1[[#This Row],[Catch crop]], Tool!C$29:M$29,1,0)","v":{"$error":"#N/A"}}]
["Tolerance to drought","Tolerances","White clover","Good",2,{"$f":"HLOOKUP(Table1[[#This Row],[Catch crop]], Tool!C$29:M$29,1,0)","v":{"$error":"#N/A"}}]
["Tolerance to shade","Tolerances","White clover","Very good",3,{"$f":"HLOOKUP(Table1[[#This Row],[Catch crop]], Tool!C$29:M$29,1,0)","v":{"$error":"#N/A"}}]
["Tolerance to flood","Tolerances","White clover","Very good",3,{"$f":"HLOOKUP(Table1[[#This Row],[Catch crop]], Tool!C$29:M$29,1,0)","v":{"$error":"#N/A"}}]
["Tolerance to low fertility","Tolerances","White clover","Good",2,{"$f":"HLOOKUP(Table1[[#This Row],[Catch crop]], Tool!C$29:M$29,1,0)","v":{"$error":"#N/A"}}]
["Min. germination temperature, C","Tolerances","White clover",null,4.4000000000000004,{"$f":"HLOOKUP(Table1[[#This Row],[Catch crop]], Tool!C$29:M$29,1,0)","v":{"$error":"#N/A"}}]
["Subsoiler","Potential advantages: soil impact","White clover","Fair",1,{"$f":"HLOOKUP(Table1[[#This Row],[Catch crop]], Tool!C$29:M$29,1,0)","v":{"$error":"#N/A"}}]
["Free P and K","Potential advantages: soil impact","White clover","Fair",1,{"$f":"HLOOKUP(Table1[[#This Row],[Catch crop]], Tool!C$29:M$29,1,0)","v":{"$error":"#N/A"}}]
["Loosen topsoil","Potential advantages: soil impact","White clover","Very good",3,{"$f":"HLOOKUP(Table1[[#This Row],[Catch crop]], Tool!C$29:M$29,1,0)","v":{"$error":"#N/A"}}]
["Nematodes","Potential advantages: soil ecology","White clover","Poor",0,{"$f":"HLOOKUP(Table1[[#This Row],[Catch crop]], Tool!C$29:M$29,1,0)","v":{"$error":"#N/A"}}]
["Disease","Potential advantages: soil ecology","White clover","Poor",0,{"$f":"HLOOKUP(Table1[[#This Row],[Catch crop]], Tool!C$29:M$29,1,0)","v":{"$error":"#N/A"}}]
["Allelopathic","Potential advantages: soil ecology","White clover","Good",2,{"$f":"HLOOKUP(Table1[[#This Row],[Catch crop]], Tool!C$29:M$29,1,0)","v":{"$error":"#N/A"}}]
["Choke weeds","Potential advantages: soil ecology","White clover","Very good",3,{"$f":"HLOOKUP(Table1[[#This Row],[Catch crop]], Tool!C$29:M$29,1,0)","v":{"$error":"#N/A"}}]
["Attract beneficials","Potential advantages: other","White clover","Good",2,{"$f":"HLOOKUP(Table1[[#This Row],[Catch crop]], Tool!C$29:M$29,1,0)","v":{"$error":"#N/A"}}]
["Bears traffic","Potential advantages: other","White clover","Excellent",4,{"$f":"HLOOKUP(Table1[[#This Row],[Catch crop]], Tool!C$29:M$29,1,0)","v":{"$error":"#N/A"}}]
["Short windows","Potential advantages: other","White clover","Good",2,{"$f":"HLOOKUP(Table1[[#This Row],[Catch crop]], Tool!C$29:M$29,1,0)","v":{"$error":"#N/A"}}]
["Weed potential","Potential disadvantages: increase pest risks","White clover","Could be a minor problem",2,{"$f":"HLOOKUP(Table1[[#This Row],[Catch crop]], Tool!C$29:M$29,1,0)","v":{"$error":"#N/A"}}]
["Insects/ nematodes","Potential disadvantages: increase pest risks","White clover","Could be a minor problem",2,{"$f":"HLOOKUP(Table1[[#This Row],[Catch crop]], Tool!C$29:M$29,1,0)","v":{"$error":"#N/A"}}]
["Crop disease","Potential disadvantages: increase pest risks","White clover","Occasionally a minor problem",3,{"$f":"HLOOKUP(Table1[[#This Row],[Catch crop]], Tool!C$29:M$29,1,0)","v":{"$error":"#N/A"}}]
["Hinder crops","Potential disadvantages: management challenges","White clover","Could be a moderate problem",1,{"$f":"HLOOKUP(Table1[[#This Row],[Catch crop]], Tool!C$29:M$29,1,0)","v":{"$error":"#N/A"}}]
["Establishing","Potential disadvantages: management challenges","White clover","Occasionally a minor problem",3,{"$f":"HLOOKUP(Table1[[#This Row],[Catch crop]], Tool!C$29:M$29,1,0)","v":{"$error":"#N/A"}}]
["Killing by tillage","Potential disadvantages: management challenges","White clover","Problem",0,{"$f":"HLOOKUP(Table1[[#This Row],[Catch crop]], Tool!C$29:M$29,1,0)","v":{"$error":"#N/A"}}]
["Killing by mow","Potential disadvantages: management challenges","White clover","Could be a minor problem",2,{"$f":"HLOOKUP(Table1[[#This Row],[Catch crop]], Tool!C$29:M$29,1,0)","v":{"$error":"#N/A"}}]
["Incorporation of mature stand","Potential disadvantages: management challenges","White clover","Occasionally a minor problem",3,{"$f":"HLOOKUP(Table1[[#This Row],[Catch crop]], Tool!C$29:M$29,1,0)","v":{"$error":"#N/A"}}]
["Store excess N","Performance and role","Red clover","Good",2,{"$f":"HLOOKUP(Table1[[#This Row],[Catch crop]], Tool!C$29:M$29,1,0)","v":{"$error":"#N/A"}}]
["Organic matter improvement","Performance and role","Red clover","Very good",3,{"$f":"HLOOKUP(Table1[[#This Row],[Catch crop]], Tool!C$29:M$29,1,0)","v":{"$error":"#N/A"}}]
["Erosion fighter","Performance and role","Red clover","Good",2,{"$f":"HLOOKUP(Table1[[#This Row],[Catch crop]], Tool!C$29:M$29,1,0)","v":{"$error":"#N/A"}}]
["Weed fighter","Performance and role","Red clover","Very good",3,{"$f":"HLOOKUP(Table1[[#This Row],[Catch crop]], Tool!C$29:M$29,1,0)","v":{"$error":"#N/A"}}]
["Good grazing","Performance and role","Red clover","Excellent",4,{"$f":"HLOOKUP(Table1[[#This Row],[Catch crop]], Tool!C$29:M$29,1,0)","v":{"$error":"#N/A"}}]
["Quick growth","Performance and role","Red clover","Fair",1,{"$f":"HLOOKUP(Table1[[#This Row],[Catch crop]], Tool!C$29:M$29,1,0)","v":{"$error":"#N/A"}}]
["Lasting residue","Performance and role","Red clover","Fair",1,{"$f":"HLOOKUP(Table1[[#This Row],[Catch crop]], Tool!C$29:M$29,1,0)","v":{"$error":"#N/A"}}]
["Length of vegetative stage","Performance and role","Red clover","Good",2,{"$f":"HLOOKUP(Table1[[#This Row],[Catch crop]], Tool!C$29:M$29,1,0)","v":{"$error":"#N/A"}}]
["Serving as a companion crop","Performance and role","Red clover","Excellent",4,{"$f":"HLOOKUP(Table1[[#This Row],[Catch crop]], Tool!C$29:M$29,1,0)","v":{"$error":"#N/A"}}]
["Cold/frost resistance","Tolerances","Red clover","Excellent",4,{"$f":"HLOOKUP(Table1[[#This Row],[Catch crop]], Tool!C$29:M$29,1,0)","v":{"$error":"#N/A"}}]
["Tolerance to heat","Tolerances","Red clover","Fair",1,{"$f":"HLOOKUP(Table1[[#This Row],[Catch crop]], Tool!C$29:M$29,1,0)","v":{"$error":"#N/A"}}]
["Tolerance to drought","Tolerances","Red clover","Fair",1,{"$f":"HLOOKUP(Table1[[#This Row],[Catch crop]], Tool!C$29:M$29,1,0)","v":{"$error":"#N/A"}}]
["Tolerance to shade","Tolerances","Red clover","Very good",3,{"$f":"HLOOKUP(Table1[[#This Row],[Catch crop]], Tool!C$29:M$29,1,0)","v":{"$error":"#N/A"}}]
["Tolerance to flood","Tolerances","Red clover","Good",2,{"$f":"HLOOKUP(Table1[[#This Row],[Catch crop]], Tool!C$29:M$29,1,0)","v":{"$error":"#N/A"}}]
["Tolerance to low fertility","Tolerances","Red clover","Fair",1,{"$f":"HLOOKUP(Table1[[#This Row],[Catch crop]], Tool!C$29:M$29,1,0)","v":{"$error":"#N/A"}}]
["Min. germination temperature, C","Tolerances","Red clover",null,5,{"$f":"HLOOKUP(Table1[[#This Row],[Catch crop]], Tool!C$29:M$29,1,0)","v":{"$error":"#N/A"}}]
["Subsoiler","Potential advantages: soil impact","Red clover","Excellent",4,{"$f":"HLOOKUP(Table1[[#This Row],[Catch crop]], Tool!C$29:M$29,1,0)","v":{"$error":"#N/A"}}]
["Free P and K","Potential advantages: soil impact","Red clover","Very good",3,{"$f":"HLOOKUP(Table1[[#This Row],[Catch crop]], Tool!C$29:M$29,1,0)","v":{"$error":"#N/A"}}]
["Loosen topsoil","Potential advantages: soil impact","Red clover","Good",2,{"$f":"HLOOKUP(Table1[[#This Row],[Catch crop]], Tool!C$29:M$29,1,0)","v":{"$error":"#N/A"}}]
["Nematodes","Potential advantages: soil ecology","Red clover","Fair",1,{"$f":"HLOOKUP(Table1[[#This Row],[Catch crop]], Tool!C$29:M$29,1,0)","v":{"$error":"#N/A"}}]
["Disease","Potential advantages: soil ecology","Red clover","Fair",1,{"$f":"HLOOKUP(Table1[[#This Row],[Catch crop]], Tool!C$29:M$29,1,0)","v":{"$error":"#N/A"}}]
["Allelopathic","Potential advantages: soil ecology","Red clover","Good",2,{"$f":"HLOOKUP(Table1[[#This Row],[Catch crop]], Tool!C$29:M$29,1,0)","v":{"$error":"#N/A"}}]
["Choke weeds","Potential advantages: soil ecology","Red clover","Good",2,{"$f":"HLOOKUP(Table1[[#This Row],[Catch crop]], Tool!C$29:M$29,1,0)","v":{"$error":"#N/A"}}]
["Attract beneficials","Potential advantages: other","Red clover","Very good",3,{"$f":"HLOOKUP(Table1[[#This Row],[Catch crop]], Tool!C$29:M$29,1,0)","v":{"$error":"#N/A"}}]
["Bears traffic","Potential advantages: other","Red clover","Good",2,{"$f":"HLOOKUP(Table1[[#This Row],[Catch crop]], Tool!C$29:M$29,1,0)","v":{"$error":"#N/A"}}]
["Short windows","Potential advantages: other","Red clover","Good",2,{"$f":"HLOOKUP(Table1[[#This Row],[Catch crop]], Tool!C$29:M$29,1,0)","v":{"$error":"#N/A"}}]
["Weed potential","Potential disadvantages: increase pest risks","Red clover","Could be a minor problem",2,{"$f":"HLOOKUP(Table1[[#This Row],[Catch crop]], Tool!C$29:M$29,1,0)","v":{"$error":"#N/A"}}]
["Insects/ nematodes","Potential disadvantages: increase pest risks","Red clover","Could be a moderate problem",1,{"$f":"HLOOKUP(Table1[[#This Row],[Catch crop]], Tool!C$29:M$29,1,0)","v":{"$error":"#N/A"}}]
["Crop disease","Potential disadvantages: increase pest risks","Red clover","Occasionally a minor problem",3,{"$f":"HLOOKUP(Table1[[#This Row],[Catch crop]], Tool!C$29:M$29,1,0)","v":{"$error":"#N/A"}}]
["Hinder crops","Potential disadvantages: management challenges","Red clover","Not a problem",4,{"$f":"HLOOKUP(Table1[[#This Row],[Catch crop]], Tool!C$29:M$29,1,0)","v":{"$error":"#N/A"}}]
["Establishing","Potential disadvantages: management challenges","Red clover","Occasionally a minor problem",3,{"$f":"HLOOKUP(Table1[[#This Row],[Catch crop]], Tool!C$29:M$29,1,0)","v":{"$error":"#N/A"}}]
["Killing by tillage","Potential disadvantages: management challenges","Red clover","Could be a minor problem",2,{"$f":"HLOOKUP(Table1[[#This Row],[Catch crop]], Tool!C$29:M$29,1,0)","v":{"$error":"#N/A"}}]
["Killing by mow","Potential disadvantages: management challenges","Red clover","Could be a moderate problem",1,{"$f":"HLOOKUP(Table1[[#This Row],[Catch crop]], Tool!C$29:M$29,1,0)","v":{"$error":"#N/A"}}]
["Incorporation of mature stand","Potential disadvantages: management challenges","Red clover","Occasionally a minor problem",3,{"$f":"HLOOKUP(Table1[[#This Row],[Catch crop]], Tool!C$29:M$29,1,0)","v":{"$error":"#N/A"}}]
["Store excess N","Performance and role","White melilot","Fair",1,{"$f":"HLOOKUP(Table1[[#This Row],[Catch crop]], Tool!C$29:M$29,1,0)","v":{"$error":"#N/A"}}]
["Organic matter improvement","Performance and role","White melilot","Excellent",4,{"$f":"HLOOKUP(Table1[[#This Row],[Catch crop]], Tool!C$29:M$29,1,0)","v":{"$error":"#N/A"}}]
["Erosion fighter","Performance and role","White melilot","Very good",3,{"$f":"HLOOKUP(Table1[[#This Row],[Catch crop]], Tool!C$29:M$29,1,0)","v":{"$error":"#N/A"}}]
["Weed fighter","Performance and role","White melilot","Very good",3,{"$f":"HLOOKUP(Table1[[#This Row],[Catch crop]], Tool!C$29:M$29,1,0)","v":{"$error":"#N/A"}}]
["Good grazing","Performance and role","White melilot","Very good",3,{"$f":"HLOOKUP(Table1[[#This Row],[Catch crop]], Tool!C$29:M$29,1,0)","v":{"$error":"#N/A"}}]
["Quick growth","Performance and role","White melilot","Good",2,{"$f":"HLOOKUP(Table1[[#This Row],[Catch crop]], Tool!C$29:M$29,1,0)","v":{"$error":"#N/A"}}]
["Lasting residue","Performance and role","White melilot","Very good",3,{"$f":"HLOOKUP(Table1[[#This Row],[Catch crop]], Tool!C$29:M$29,1,0)","v":{"$error":"#N/A"}}]
["Length of vegetative stage","Performance and role","White melilot","Very good",3,{"$f":"HLOOKUP(Table1[[#This Row],[Catch crop]], Tool!C$29:M$29,1,0)","v":{"$error":"#N/A"}}]
["Serving as a companion crop","Performance and role","White melilot","Good",2,{"$f":"HLOOKUP(Table1[[#This Row],[Catch crop]], Tool!C$29:M$29,1,0)","v":{"$error":"#N/A"}}]
["Cold/frost resistance","Tolerances","White melilot","Excellent",4,{"$f":"HLOOKUP(Table1[[#This Row],[Catch crop]], Tool!C$29:M$29,1,0)","v":{"$error":"#N/A"}}]
["Tolerance to heat","Tolerances","White melilot","Very good",3,{"$f":"HLOOKUP(Table1[[#This Row],[Catch crop]], Tool!C$29:M$29,1,0)","v":{"$error":"#N/A"}}]
["Tolerance to drought","Tolerances","White melilot","Excellent",4,{"$f":"HLOOKUP(Table1[[#This Row],[Catch crop]], Tool!C$29:M$29,1,0)","v":{"$error":"#N/A"}}]
["Tolerance to shade","Tolerances","White melilot","Fair",1,{"$f":"HLOOKUP(Table1[[#This Row],[Catch crop]], Tool!C$29:M$29,1,0)","v":{"$error":"#N/A"}}]
["Tolerance to flood","Tolerances","White melilot","Fair",1,{"$f":"HLOOKUP(Table1[[#This Row],[Catch crop]], Tool!C$29:M$29,1,0)","v":{"$error":"#N/A"}}]
["Tolerance to low fertility","Tolerances","White melilot","Excellent",4,{"$f":"HLOOKUP(Table1[[#This Row],[Catch crop]], Tool!C$29:M$29,1,0)","v":{"$error":"#N/A"}}]
["Min. germination temperature, C","Tolerances","White melilot",null,5.6,{"$f":"HLOOKUP(Table1[[#This Row],[Catch crop]], Tool!C$29:M$29,1,0)","v":{"$error":"#N/A"}}]
["Subsoiler","Potential advantages: soil impact","White melilot","Excellent",4,{"$f":"HLOOKUP(Table1[[#This Row],[Catch crop]], Tool!C$29:M$29,1,0)","v":{"$error":"#N/A"}}]
["Free P and K","Potential advantages: soil impact","White melilot","Excellent",4,{"$f":"HLOOKUP(Table1[[#This Row],[Catch crop]], Tool!C$29:M$29,1,0)","v":{"$error":"#N/A"}}]
["Loosen topsoil","Potential advantages: soil impact","White melilot","Excellent",4,{"$f":"HLOOKUP(Table1[[#This Row],[Catch crop]], Tool!C$29:M$29,1,0)","v":{"$error":"#N/A"}}]
["Nematodes","Potential advantages: soil ecology","White melilot","Fair",1,{"$f":"HLOOKUP(Table1[[#This Row],[Catch crop]], Tool!C$29:M$29,1,0)","v":{"$error":"#N/A"}}]
["Disease","Potential advantages: soil ecology","White melilot","Fair",1,{"$f":"HLOOKUP(Table1[[#This Row],[Catch crop]], Tool!C$29:M$29,1,0)","v":{"$error":"#N/A"}}]
["Allelopathic","Potential advantages: soil ecology","White melilot","Fair",1,{"$f":"HLOOKUP(Table1[[#This Row],[Catch crop]], Tool!C$29:M$29,1,0)","v":{"$error":"#N/A"}}]
["Choke weeds","Potential advantages: soil ecology","White melilot","Good",2,{"$f":"HLOOKUP(Table1[[#This Row],[Catch crop]], Tool!C$29:M$29,1,0)","v":{"$error":"#N/A"}}]
["Attract beneficials","Potential advantages: other","White melilot","Very good",3,{"$f":"HLOOKUP(Table1[[#This Row],[Catch crop]], Tool!C$29:M$29,1,0)","v":{"$error":"#N/A"}}]
["Bears traffic","Potential advantages: other","White melilot","Good",2,{"$f":"HLOOKUP(Table1[[#This Row],[Catch crop]], Tool!C$29:M$29,1,0)","v":{"$error":"#N/A"}}]
["Short windows","Potential advantages: other","White melilot","Poor",0,{"$f":"HLOOKUP(Table1[[#This Row],[Catch crop]], Tool!C$29:M$29,1,0)","v":{"$error":"#N/A"}}]
["Weed potential","Potential disadvantages: increase pest risks","White melilot","Could be a moderate problem",1,{"$f":"HLOOKUP(Table1[[#This Row],[Catch crop]], Tool!C$29:M$29,1,0)","v":{"$error":"#N/A"}}]
["Insects/ nematodes","Potential disadvantages: increase pest risks","White melilot","Could be a moderate problem",1,{"$f":"HLOOKUP(Table1[[#This Row],[Catch crop]], Tool!C$29:M$29,1,0)","v":{"$error":"#N/A"}}]
["Crop disease","Potential disadvantages: increase pest risks","White melilot","Not a problem",4,{"$f":"HLOOKUP(Table1[[#This Row],[Catch crop]], Tool!C$29:M$29,1,0)","v":{"$error":"#N/A"}}]
["Hinder crops","Potential disadvantages: management challenges","White melilot","Could be a minor problem",2,{"$f":"HLOOKUP(Table1[[#This Row],[Catch crop]], Tool!C$29:M$29,1,0)","v":{"$error":"#N/A"}}]
["Establishing","Potential disadvantages: management challenges","White melilot","Not a problem",4,{"$f":"HLOOKUP(Table1[[#This Row],[Catch crop]], Tool!C$29:M$29,1,0)","v":{"$error":"#N/A"}}]
["Killing by tillage","Potential disadvantages: management challenges","White melilot","Could be a minor problem",2,{"$f":"HLOOKUP(Table1[[#This Row],[Catch crop]], Tool!C$29:M$29,1,0)","v":{"$error":"#N/A"}}]
["Killing by mow","Potential disadvantages: management challenges","White melilot","Occasionally a minor problem",3,{"$f":"HLOOKUP(Table1[[#This Row],[Catch crop]], Tool!C$29:M$29,1,0)","v":{"$error":"#N/A"}}]
["Incorporation of mature stand","Potential disadvantages: management challenges","White melilot","Could be a moderate problem",1,{"$f":"HLOOKUP(Table1[[#This Row],[Catch crop]], Tool!C$29:M$29,1,0)","v":{"$error":"#N/A"}}]
["Store excess N","Performance and role","Italian ryegrass","Very good",3,{"$f":"HLOOKUP(Table1[[#This Row],[Catch crop]], Tool!C$29:M$29,1,0)","v":{"$error":"#N/A"}}]
["Organic matter improvement","Performance and role","Italian ryegrass","Very good",3,{"$f":"HLOOKUP(Table1[[#This Row],[Catch crop]], Tool!C$29:M$29,1,0)","v":{"$error":"#N/A"}}]
["Erosion fighter","Performance and role","Italian ryegrass","Very good",3,{"$f":"HLOOKUP(Table1[[#This Row],[Catch crop]], Tool!C$29:M$29,1,0)","v":{"$error":"#N/A"}}]
["Weed fighter","Performance and role","Italian ryegrass","Very good",3,{"$f":"HLOOKUP(Table1[[#This Row],[Catch crop]], Tool!C$29:M$29,1,0)","v":{"$error":"#N/A"}}]
["Good grazing","Performance and role","Italian ryegrass","Very good",3,{"$f":"HLOOKUP(Table1[[#This Row],[Catch crop]], Tool!C$29:M$29,1,0)","v":{"$error":"#N/A"}}]
["Quick growth","Performance and role","Italian ryegrass","Very good",3,{"$f":"HLOOKUP(Table1[[#This Row],[Catch crop]], Tool!C$29:M$29,1,0)","v":{"$error":"#N/A"}}]
["Lasting residue","Performance and role","Italian ryegrass","Very good",3,{"$f":"HLOOKUP(Table1[[#This Row],[Catch crop]], Tool!C$29:M$29,1,0)","v":{"$error":"#N/A"}}]
["Length of vegetative stage","Performance and role","Italian ryegrass","Very good",3,{"$f":"HLOOKUP(Table1[[#This Row],[Catch crop]], Tool!C$29:M$29,1,0)","v":{"$error":"#N/A"}}]
["Serving as a companion crop","Performance and role","Italian ryegrass","Excellent",4,{"$f":"HLOOKUP(Table1[[#This Row],[Catch crop]], Tool!C$29:M$29,1,0)","v":{"$error":"#N/A"}}]
["Cold/frost resistance","Tolerances","Italian ryegrass","Fair",1,{"$f":"HLOOKUP(Table1[[#This Row],[Catch crop]], Tool!C$29:M$29,1,0)","v":{"$error":"#N/A"}}]
["Tolerance to heat","Tolerances","Italian ryegrass","Fair",1,{"$f":"HLOOKUP(Table1[[#This Row],[Catch crop]], Tool!C$29:M$29,1,0)","v":{"$error":"#N/A"}}]
["Tolerance to drought","Tolerances","Italian ryegrass","Fair",1,{"$f":"HLOOKUP(Table1[[#This Row],[Catch crop]], Tool!C$29:M$29,1,0)","v":{"$error":"#N/A"}}]
["Tolerance to shade","Tolerances","Italian ryegrass","Very good",3,{"$f":"HLOOKUP(Table1[[#This Row],[Catch crop]], Tool!C$29:M$29,1,0)","v":{"$error":"#N/A"}}]
["Tolerance to flood","Tolerances","Italian ryegrass","Very good",3,{"$f":"HLOOKUP(Table1[[#This Row],[Catch crop]], Tool!C$29:M$29,1,0)","v":{"$error":"#N/A"}}]
["Tolerance to low fertility","Tolerances","Italian ryegrass","Fair",1,{"$f":"HLOOKUP(Table1[[#This Row],[Catch crop]], Tool!C$29:M$29,1,0)","v":{"$error":"#N/A"}}]
["Min. germination temperature, C","Tolerances","Italian ryegrass",null,4.4000000000000004,{"$f":"HLOOKUP(Table1[[#This Row],[Catch crop]], Tool!C$29:M$29,1,0)","v":{"$error":"#N/A"}}]
["Subsoiler","Potential advantages: soil impact","Italian ryegrass","Good",2,{"$f":"HLOOKUP(Table1[[#This Row],[Catch crop]], Tool!C$29:M$29,1,0)","v":{"$error":"#N/A"}}]
["Free P and K","Potential advantages: soil impact","Italian ryegrass","Good",2,{"$f":"HLOOKUP(Table1[[#This Row],[Catch crop]], Tool!C$29:M$29,1,0)","v":{"$error":"#N/A"}}]
["Loosen topsoil","Potential advantages: soil impact","Italian ryegrass","Excellent",4,{"$f":"HLOOKUP(Table1[[#This Row],[Catch crop]], Tool!C$29:M$29,1,0)","v":{"$error":"#N/A"}}]
["Nematodes","Potential advantages: soil ecology","Italian ryegrass","Good",2,{"$f":"HLOOKUP(Table1[[#This Row],[Catch crop]], Tool!C$29:M$29,1,0)","v":{"$error":"#N/A"}}]
["Disease","Potential advantages: soil ecology","Italian ryegrass","Good",2,{"$f":"HLOOKUP(Table1[[#This Row],[Catch crop]], Tool!C$29:M$29,1,0)","v":{"$error":"#N/A"}}]
["Allelopathic","Potential advantages: soil ecology","Italian ryegrass","Good",2,{"$f":"HLOOKUP(Table1[[#This Row],[Catch crop]], Tool!C$29:M$29,1,0)","v":{"$error":"#N/A"}}]
["Choke weeds","Potential advantages: soil ecology","Italian ryegrass","Excellent",4,{"$f":"HLOOKUP(Table1[[#This Row],[Catch crop]], Tool!C$29:M$29,1,0)","v":{"$error":"#N/A"}}]
["Attract beneficials","Potential advantages: other","Italian ryegrass","Fair",1,{"$f":"HLOOKUP(Table1[[#This Row],[Catch crop]], Tool!C$29:M$29,1,0)","v":{"$error":"#N/A"}}]
["Bears traffic","Potential advantages: other","Italian ryegrass","Excellent",4,{"$f":"HLOOKUP(Table1[[#This Row],[Catch crop]], Tool!C$29:M$29,1,0)","v":{"$error":"#N/A"}}]
["Short windows","Potential advantages: other","Italian ryegrass","Excellent",4,{"$f":"HLOOKUP(Table1[[#This Row],[Catch crop]], Tool!C$29:M$29,1,0)","v":{"$error":"#N/A"}}]
["Weed potential","Potential disadvantages: increase pest risks","Italian ryegrass","Problem",0,{"$f":"HLOOKUP(Table1[[#This Row],[Catch crop]], Tool!C$29:M$29,1,0)","v":{"$error":"#N/A"}}]
["Insects/ nematodes","Potential disadvantages: increase pest risks","Italian ryegrass","Occasionally a minor problem",3,{"$f":"HLOOKUP(Table1[[#This Row],[Catch crop]], Tool!C$29:M$29,1,0)","v":{"$error":"#N/A"}}]
["Crop disease","Potential disadvantages: increase pest risks","Italian ryegrass","Occasionally a minor problem",3,{"$f":"HLOOKUP(Table1[[#This Row],[Catch crop]], Tool!C$29:M$29,1,0)","v":{"$error":"#N/A"}}]
["Hinder crops","Potential disadvantages: management challenges","Italian ryegrass","Could be a minor problem",2,{"$f":"HLOOKUP(Table1[[#This Row],[Catch crop]], Tool!C$29:M$29,1,0)","v":{"$error":"#N/A"}}]
["Establishing","Potential disadvantages: management challenges","Italian ryegrass","Not a problem",4,{"$f":"HLOOKUP(Table1[[#This Row],[Catch crop]], Tool!C$29:M$29,1,0)","v":{"$error":"#N/A"}}]
["Killing by tillage","Potential disadvantages: management challenges","Italian ryegrass","Not a problem",4,{"$f":"HLOOKUP(Table1[[#This Row],[Catch crop]], Tool!C$29:M$29,1,0)","v":{"$error":"#N/A"}}]
["Killing by mow","Potential disadvantages: management challenges","Italian ryegrass","Not a problem",4,{"$f":"HLOOKUP(Table1[[#This Row],[Catch crop]], Tool!C$29:M$29,1,0)","v":{"$error":"#N/A"}}]
["Incorporation of mature stand","Potential disadvantages: management challenges","Italian ryegrass","Could be a minor problem",2,{"$f":"HLOOKUP(Table1[[#This Row],[Catch crop]], Tool!C$29:M$29,1,0)","v":{"$error":"#N/A"}}]
["Store excess N","Performance and role","Perrenial ryegrass",null,null,{"$f":"HLOOKUP(Table1[[#This Row],[Catch crop]], Tool!C$29:M$29,1,0)","v":{"$error":"#N/A"}}]
["Organic matter improvement","Performance and role","Perrenial ryegrass",null,null,{"$f":"HLOOKUP(Table1[[#This Row],[Catch crop]], Tool!C$29:M$29,1,0)","v":{"$error":"#N/A"}}]
["Erosion fighter","Performance and role","Perrenial ryegrass",null,null,{"$f":"HLOOKUP(Table1[[#This Row],[Catch crop]], Tool!C$29:M$29,1,0)","v":{"$error":"#N/A"}}]
["Weed fighter","Performance and role","Perrenial ryegrass",null,null,{"$f":"HLOOKUP(Table1[[#This Row],[Catch crop]], Tool!C$29:M$29,1,0)","v":{"$error":"#N/A"}}]
["Good grazing","Performance and role","Perrenial ryegrass",null,null,{"$f":"HLOOKUP(Table1[[#This Row],[Catch crop]], Tool!C$29:M$29,1,0)","v":{"$error":"#N/A"}}]
["Quick growth","Performance and role","Perrenial ryegrass",null,null,{"$f":"HLOOKUP(Table1[[#This Row],[Catch crop]], Tool!C$29:M$29,1,0)","v":{"$error":"#N/A"}}]
["Lasting residue","Performance and role","Perrenial ryegrass",null,null,{"$f":"HLOOKUP(Table1[[#This Row],[Catch crop]], Tool!C$29:M$29,1,0)","v":{"$error":"#N/A"}}]
["Length of vegetative stage","Performance and role","Perrenial ryegrass",null,null,{"$f":"HLOOKUP(Table1[[#This Row],[Catch crop]], Tool!C$29:M$29,1,0)","v":{"$error":"#N/A"}}]
["Serving as a companion crop","Performance and role","Perrenial ryegrass",null,null,{"$f":"HLOOKUP(Table1[[#This Row],[Catch crop]], Tool!C$29:M$29,1,0)","v":{"$error":"#N/A"}}]
["Cold/frost resistance","Tolerances","Perrenial ryegrass",null,null,{"$f":"HLOOKUP(Table1[[#This Row],[Catch crop]], Tool!C$29:M$29,1,0)","v":{"$error":"#N/A"}}]
["Tolerance to heat","Tolerances","Perrenial ryegrass",null,null,{"$f":"HLOOKUP(Table1[[#This Row],[Catch crop]], Tool!C$29:M$29,1,0)","v":{"$error":"#N/A"}}]
["Tolerance to drought","Tolerances","Perrenial ryegrass",null,null,{"$f":"HLOOKUP(Table1[[#This Row],[Catch crop]], Tool!C$29:M$29,1,0)","v":{"$error":"#N/A"}}]
["Tolerance to shade","Tolerances","Perrenial ryegrass",null,null,{"$f":"HLOOKUP(Table1[[#This Row],[Catch crop]], Tool!C$29:M$29,1,0)","v":{"$error":"#N/A"}}]
["Tolerance to flood","Tolerances","Perrenial ryegrass",null,null,{"$f":"HLOOKUP(Table1[[#This Row],[Catch crop]], Tool!C$29:M$29,1,0)","v":{"$error":"#N/A"}}]
["Tolerance to low fertility","Tolerances","Perrenial ryegrass",null,null,{"$f":"HLOOKUP(Table1[[#This Row],[Catch crop]], Tool!C$29:M$29,1,0)","v":{"$error":"#N/A"}}]
["Min. germination temperature, C","Tolerances","Perrenial ryegrass",null,null,{"$f":"HLOOKUP(Table1[[#This Row],[Catch crop]], Tool!C$29:M$29,1,0)","v":{"$error":"#N/A"}}]
["Subsoiler","Potential advantages: soil impact","Perrenial ryegrass",null,null,{"$f":"HLOOKUP(Table1[[#This Row],[Catch crop]], Tool!C$29:M$29,1,0)","v":{"$error":"#N/A"}}]
["Free P and K","Potential advantages: soil impact","Perrenial ryegrass",null,null,{"$f":"HLOOKUP(Table1[[#This Row],[Catch crop]], Tool!C$29:M$29,1,0)","v":{"$error":"#N/A"}}]
["Loosen topsoil","Potential advantages: soil impact","Perrenial ryegrass",null,null,{"$f":"HLOOKUP(Table1[[#This Row],[Catch crop]], Tool!C$29:M$29,1,0)","v":{"$error":"#N/A"}}]
["Nematodes","Potential advantages: soil ecology","Perrenial ryegrass",null,null,{"$f":"HLOOKUP(Table1[[#This Row],[Catch crop]], Tool!C$29:M$29,1,0)","v":{"$error":"#N/A"}}]
["Disease","Potential advantages: soil ecology","Perrenial ryegrass",null,null,{"$f":"HLOOKUP(Table1[[#This Row],[Catch crop]], Tool!C$29:M$29,1,0)","v":{"$error":"#N/A"}}]
["Allelopathic","Potential advantages: soil ecology","Perrenial ryegrass",null,null,{"$f":"HLOOKUP(Table1[[#This Row],[Catch crop]], Tool!C$29:M$29,1,0)","v":{"$error":"#N/A"}}]
["Choke weeds","Potential advantages: soil ecology","Perrenial ryegrass",null,null,{"$f":"HLOOKUP(Table1[[#This Row],[Catch crop]], Tool!C$29:M$29,1,0)","v":{"$error":"#N/A"}}]
["Attract beneficials","Potential advantages: other","Perrenial ryegrass",null,null,{"$f":"HLOOKUP(Table1[[#This Row],[Catch crop]], Tool!C$29:M$29,1,0)","v":{"$error":"#N/A"}}]
["Bears traffic","Potential advantages: other","Perrenial ryegrass",null,null,{"$f":"HLOOKUP(Table1[[#This Row],[Catch crop]], Tool!C$29:M$29,1,0)","v":{"$error":"#N/A"}}]
["Short windows","Potential advantages: other","Perrenial ryegrass",null,null,{"$f":"HLOOKUP(Table1[[#This Row],[Catch crop]], Tool!C$29:M$29,1,0)","v":{"$error":"#N/A"}}]
["Weed potential","Potential disadvantages: increase pest risks","Perrenial ryegrass",null,null,{"$f":"HLOOKUP(Table1[[#This Row],[Catch crop]], Tool!C$29:M$29,1,0)","v":{"$error":"#N/A"}}]
["Insects/ nematodes","Potential disadvantages: increase pest risks","Perrenial ryegrass",null,null,{"$f":"HLOOKUP(Table1[[#This Row],[Catch crop]], Tool!C$29:M$29,1,0)","v":{"$error":"#N/A"}}]
["Crop disease","Potential disadvantages: increase pest risks","Perrenial ryegrass",null,null,{"$f":"HLOOKUP(Table1[[#This Row],[Catch crop]], Tool!C$29:M$29,1,0)","v":{"$error":"#N/A"}}]
["Hinder crops","Potential disadvantages: management challenges","Perrenial ryegrass",null,null,{"$f":"HLOOKUP(Table1[[#This Row],[Catch crop]], Tool!C$29:M$29,1,0)","v":{"$error":"#N/A"}}]
["Establishing","Potential disadvantages: management challenges","Perrenial ryegrass",null,null,{"$f":"HLOOKUP(Table1[[#This Row],[Catch crop]], Tool!C$29:M$29,1,0)","v":{"$error":"#N/A"}}]
["Killing by tillage","Potential disadvantages: management challenges","Perrenial ryegrass",null,null,{"$f":"HLOOKUP(Table1[[#This Row],[Catch crop]], Tool!C$29:M$29,1,0)","v":{"$error":"#N/A"}}]
["Killing by mow","Potential disadvantages: management challenges","Perrenial ryegrass",null,null,{"$f":"HLOOKUP(Table1[[#This Row],[Catch crop]], Tool!C$29:M$29,1,0)","v":{"$error":"#N/A"}}]
["Incorporation of mature stand","Potential disadvantages: management challenges","Perrenial ryegrass",null,null,{"$f":"HLOOKUP(Table1[[#This Row],[Catch crop]], Tool!C$29:M$29,1,0)","v":{"$error":"#N/A"}}]
["Store excess N","Performance and role","Phacelia","Fair",1,{"$f":"HLOOKUP(Table1[[#This Row],[Catch crop]], Tool!C$29:M$29,1,0)","v":{"$error":"#N/A"}}]
["Organic matter improvement","Performance and role","Phacelia","Very good",3,{"$f":"HLOOKUP(Table1[[#This Row],[Catch crop]], Tool!C$29:M$29,1,0)","v":{"$error":"#N/A"}}]
["Erosion fighter","Performance and role","Phacelia","Very good",3,{"$f":"HLOOKUP(Table1[[#This Row],[Catch crop]], Tool!C$29:M$29,1,0)","v":{"$error":"#N/A"}}]
["Weed fighter","Performance and role","Phacelia","Very good",3,{"$f":"HLOOKUP(Table1[[#This Row],[Catch crop]], Tool!C$29:M$29,1,0)","v":{"$error":"#N/A"}}]
["Good grazing","Performance and role","Phacelia","Good",2,{"$f":"HLOOKUP(Table1[[#This Row],[Catch crop]], Tool!C$29:M$29,1,0)","v":{"$error":"#N/A"}}]
["Quick growth","Performance and role","Phacelia","Very good",3,{"$f":"HLOOKUP(Table1[[#This Row],[Catch crop]], Tool!C$29:M$29,1,0)","v":{"$error":"#N/A"}}]
["Lasting residue","Performance and role","Phacelia","Good",2,{"$f":"HLOOKUP(Table1[[#This Row],[Catch crop]], Tool!C$29:M$29,1,0)","v":{"$error":"#N/A"}}]
["Length of vegetative stage","Performance and role","Phacelia","Good",2,{"$f":"HLOOKUP(Table1[[#This Row],[Catch crop]], Tool!C$29:M$29,1,0)","v":{"$error":"#N/A"}}]
["Serving as a companion crop","Performance and role","Phacelia","Excellent",4,{"$f":"HLOOKUP(Table1[[#This Row],[Catch crop]], Tool!C$29:M$29,1,0)","v":{"$error":"#N/A"}}]
["Cold/frost resistance","Tolerances","Phacelia","Poor",0,{"$f":"HLOOKUP(Table1[[#This Row],[Catch crop]], Tool!C$29:M$29,1,0)","v":{"$error":"#N/A"}}]
["Tolerance to heat","Tolerances","Phacelia","Good",2,{"$f":"HLOOKUP(Table1[[#This Row],[Catch crop]], Tool!C$29:M$29,1,0)","v":{"$error":"#N/A"}}]
["Tolerance to drought","Tolerances","Phacelia","Excellent",4,{"$f":"HLOOKUP(Table1[[#This Row],[Catch crop]], Tool!C$29:M$29,1,0)","v":{"$error":"#N/A"}}]
["Tolerance to shade","Tolerances","Phacelia","Very good",3,{"$f":"HLOOKUP(Table1[[#This Row],[Catch crop]], Tool!C$29:M$29,1,0)","v":{"$error":"#N/A"}}]
["Tolerance to flood","Tolerances","Phacelia","Very good",3,{"$f":"HLOOKUP(Table1[[#This Row],[Catch crop]], Tool!C$29:M$29,1,0)","v":{"$error":"#N/A"}}]
["Tolerance to low fertility","Tolerances","Phacelia","Excellent",4,{"$f":"HLOOKUP(Table1[[#This Row],[Catch crop]], Tool!C$29:M$29,1,0)","v":{"$error":"#N/A"}}]
["Min. germination temperature, C","Tolerances","Phacelia",null,null,{"$f":"HLOOKUP(Table1[[#This Row],[Catch crop]], Tool!C$29:M$29,1,0)","v":{"$error":"#N/A"}}]
["Subsoiler","Potential advantages: soil impact","Phacelia","Fair",1,{"$f":"HLOOKUP(Table1[[#This Row],[Catch crop]], Tool!C$29:M$29,1,0)","v":{"$error":"#N/A"}}]
["Free P and K","Potential advantages: soil impact","Phacelia","Good",2,{"$f":"HLOOKUP(Table1[[#This Row],[Catch crop]], Tool!C$29:M$29,1,0)","v":{"$error":"#N/A"}}]
["Loosen topsoil","Potential advantages: soil impact","Phacelia","Very good",3,{"$f":"HLOOKUP(Table1[[#This Row],[Catch crop]], Tool!C$29:M$29,1,0)","v":{"$error":"#N/A"}}]
["Nematodes","Potential advantages: soil ecology","Phacelia","Very good",3,{"$f":"HLOOKUP(Table1[[#This Row],[Catch crop]], Tool!C$29:M$29,1,0)","v":{"$error":"#N/A"}}]
["Disease","Potential advantages: soil ecology","Phacelia","Very good",3,{"$f":"HLOOKUP(Table1[[#This Row],[Catch crop]], Tool!C$29:M$29,1,0)","v":{"$error":"#N/A"}}]
["Allelopathic","Potential advantages: soil ecology","Phacelia","Good",2,{"$f":"HLOOKUP(Table1[[#This Row],[Catch crop]], Tool!C$29:M$29,1,0)","v":{"$error":"#N/A"}}]
["Choke weeds","Potential advantages: soil ecology","Phacelia","Very good",3,{"$f":"HLOOKUP(Table1[[#This Row],[Catch crop]], Tool!C$29:M$29,1,0)","v":{"$error":"#N/A"}}]
["Attract beneficials","Potential advantages: other","Phacelia","Excellent",4,{"$f":"HLOOKUP(Table1[[#This Row],[Catch crop]], Tool!C$29:M$29,1,0)","v":{"$error":"#N/A"}}]
["Bears traffic","Potential advantages: other","Phacelia","Good",2,{"$f":"HLOOKUP(Table1[[#This Row],[Catch crop]], Tool!C$29:M$29,1,0)","v":{"$error":"#N/A"}}]
["Short windows","Potential advantages: other","Phacelia","Good",2,{"$f":"HLOOKUP(Table1[[#This Row],[Catch crop]], Tool!C$29:M$29,1,0)","v":{"$error":"#N/A"}}]
["Weed potential","Potential disadvantages: increase pest risks","Phacelia","Could be a minor problem",2,{"$f":"HLOOKUP(Table1[[#This Row],[Catch crop]], Tool!C$29:M$29,1,0)","v":{"$error":"#N/A"}}]
["Insects/ nematodes","Potential disadvantages: increase pest risks","Phacelia","Not a problem",4,{"$f":"HLOOKUP(Table1[[#This Row],[Catch crop]], Tool!C$29:M$29,1,0)","v":{"$error":"#N/A"}}]
["Crop disease","Potential disadvantages: increase pest risks","Phacelia","Occasionally a minor problem",3,{"$f":"HLOOKUP(Table1[[#This Row],[Catch crop]], Tool!C$29:M$29,1,0)","v":{"$error":"#N/A"}}]
["Hinder crops","Potential disadvantages: management challenges","Phacelia","Not a problem",4,{"$f":"HLOOKUP(Table1[[#This Row],[Catch crop]], Tool!C$29:M$29,1,0)","v":{"$error":"#N/A"}}]
["Establishing","Potential disadvantages: management challenges","Phacelia","Could be a minor problem",2,{"$f":"HLOOKUP(Table1[[#This Row],[Catch crop]], Tool!C$29:M$29,1,0)","v":{"$error":"#N/A"}}]
["Killing by tillage","Potential disadvantages: management challenges","Phacelia","Occasionally a minor problem",3,{"$f":"HLOOKUP(Table1[[#This Row],[Catch crop]], Tool!C$29:M$29,1,0)","v":{"$error":"#N/A"}}]
["Killing by mow","Potential disadvantages: management challenges","Phacelia","Occasionally a minor problem",3,{"$f":"HLOOKUP(Table1[[#This Row],[Catch crop]], Tool!C$29:M$29,1,0)","v":{"$error":"#N/A"}}]
["Incorporation of mature stand","Potential disadvantages: management challenges","Phacelia","Occasionally a minor problem",3,{"$f":"HLOOKUP(Table1[[#This Row],[Catch crop]], Tool!C$29:M$29,1,0)","v":{"$error":"#N/A"}}]
["Store excess N","Performance and role","Cock's foot",null,null,{"$f":"HLOOKUP(Table1[[#This Row],[Catch crop]], Tool!C$29:M$29,1,0)","v":{"$error":"#N/A"}}]
["Organic matter improvement","Performance and role","Cock's foot",null,null,{"$f":"HLOOKUP(Table1[[#This Row],[Catch crop]], Tool!C$29:M$29,1,0)","v":{"$error":"#N/A"}}]
["Erosion fighter","Performance and role","Cock's foot",null,null,{"$f":"HLOOKUP(Table1[[#This Row],[Catch crop]], Tool!C$29:M$29,1,0)","v":{"$error":"#N/A"}}]
["Weed fighter","Performance and role","Cock's foot",null,null,{"$f":"HLOOKUP(Table1[[#This Row],[Catch crop]], Tool!C$29:M$29,1,0)","v":{"$error":"#N/A"}}]
["Good grazing","Performance and role","Cock's foot",null,null,{"$f":"HLOOKUP(Table1[[#This Row],[Catch crop]], Tool!C$29:M$29,1,0)","v":{"$error":"#N/A"}}]
["Quick growth","Performance and role","Cock's foot",null,null,{"$f":"HLOOKUP(Table1[[#This Row],[Catch crop]], Tool!C$29:M$29,1,0)","v":{"$error":"#N/A"}}]
["Lasting residue","Performance and role","Cock's foot",null,null,{"$f":"HLOOKUP(Table1[[#This Row],[Catch crop]], Tool!C$29:M$29,1,0)","v":{"$error":"#N/A"}}]
["Length of vegetative stage","Performance and role","Cock's foot",null,null,{"$f":"HLOOKUP(Table1[[#This Row],[Catch crop]], Tool!C$29:M$29,1,0)","v":{"$error":"#N/A"}}]
["Serving as a companion crop","Performance and role","Cock's foot",null,null,{"$f":"HLOOKUP(Table1[[#This Row],[Catch crop]], Tool!C$29:M$29,1,0)","v":{"$error":"#N/A"}}]
["Cold/frost resistance","Tolerances","Cock's foot",null,null,{"$f":"HLOOKUP(Table1[[#This Row],[Catch crop]], Tool!C$29:M$29,1,0)","v":{"$error":"#N/A"}}]
["Tolerance to heat","Tolerances","Cock's foot",null,null,{"$f":"HLOOKUP(Table1[[#This Row],[Catch crop]], Tool!C$29:M$29,1,0)","v":{"$error":"#N/A"}}]
["Tolerance to drought","Tolerances","Cock's foot",null,null,{"$f":"HLOOKUP(Table1[[#This Row],[Catch crop]], Tool!C$29:M$29,1,0)","v":{"$error":"#N/A"}}]
["Tolerance to shade","Tolerances","Cock's foot",null,null,{"$f":"HLOOKUP(Table1[[#This Row],[Catch crop]], Tool!C$29:M$29,1,0)","v":{"$error":"#N/A"}}]
["Tolerance to flood","Tolerances","Cock's foot",null,null,{"$f":"HLOOKUP(Table1[[#This Row],[Catch crop]], Tool!C$29:M$29,1,0)","v":{"$error":"#N/A"}}]
["Tolerance to low fertility","Tolerances","Cock's foot",null,null,{"$f":"HLOOKUP(Table1[[#This Row],[Catch crop]], Tool!C$29:M$29,1,0)","v":{"$error":"#N/A"}}]
["Min. germination temperature, C","Tolerances","Cock's foot",null,null,{"$f":"HLOOKUP(Table1[[#This Row],[Catch crop]], Tool!C$29:M$29,1,0)","v":{"$error":"#N/A"}}]
["Subsoiler","Potential advantages: soil impact","Cock's foot",null,null,{"$f":"HLOOKUP(Table1[[#This Row],[Catch crop]], Tool!C$29:M$29,1,0)","v":{"$error":"#N/A"}}]
["Free P and K","Potential advantages: soil impact","Cock's foot",null,null,{"$f":"HLOOKUP(Table1[[#This Row],[Catch crop]], Tool!C$29:M$29,1,0)","v":{"$error":"#N/A"}}]
["Loosen topsoil","Potential advantages: soil impact","Cock's foot",null,null,{"$f":"HLOOKUP(Table1[[#This Row],[Catch crop]], Tool!C$29:M$29,1,0)","v":{"$error":"#N/A"}}]
["Nematodes","Potential advantages: soil ecology","Cock's foot",null,null,{"$f":"HLOOKUP(Table1[[#This Row],[Catch crop]], Tool!C$29:M$29,1,0)","v":{"$error":"#N/A"}}]
["Disease","Potential advantages: soil ecology","Cock's foot",null,null,{"$f":"HLOOKUP(Table1[[#This Row],[Catch crop]], Tool!C$29:M$29,1,0)","v":{"$error":"#N/A"}}]
["Allelopathic","Potential advantages: soil ecology","Cock's foot",null,null,{"$f":"HLOOKUP(Table1[[#This Row],[Catch crop]], Tool!C$29:M$29,1,0)","v":{"$error":"#N/A"}}]
["Choke weeds","Potential advantages: soil ecology","Cock's foot",null,null,{"$f":"HLOOKUP(Table1[[#This Row],[Catch crop]], Tool!C$29:M$29,1,0)","v":{"$error":"#N/A"}}]
["Attract beneficials","Potential advantages: other","Cock's foot",null,null,{"$f":"HLOOKUP(Table1[[#This Row],[Catch crop]], Tool!C$29:M$29,1,0)","v":{"$error":"#N/A"}}]
["Bears traffic","Potential advantages: other","Cock's foot",null,null,{"$f":"HLOOKUP(Table1[[#This Row],[Catch crop]], Tool!C$29:M$29,1,0)","v":{"$error":"#N/A"}}]
["Short windows","Potential advantages: other","Cock's foot",null,null,{"$f":"HLOOKUP(Table1[[#This Row],[Catch crop]], Tool!C$29:M$29,1,0)","v":{"$error":"#N/A"}}]
["Weed potential","Potential disadvantages: increase pest risks","Cock's foot",null,null,{"$f":"HLOOKUP(Table1[[#This Row],[Catch crop]], Tool!C$29:M$29,1,0)","v":{"$error":"#N/A"}}]
["Insects/ nematodes","Potential disadvantages: increase pest risks","Cock's foot",null,null,{"$f":"HLOOKUP(Table1[[#This Row],[Catch crop]], Tool!C$29:M$29,1,0)","v":{"$error":"#N/A"}}]
["Crop disease","Potential disadvantages: increase pest risks","Cock's foot",null,null,{"$f":"HLOOKUP(Table1[[#This Row],[Catch crop]], Tool!C$29:M$29,1,0)","v":{"$error":"#N/A"}}]
["Hinder crops","Potential disadvantages: management challenges","Cock's foot",null,null,{"$f":"HLOOKUP(Table1[[#This Row],[Catch crop]], Tool!C$29:M$29,1,0)","v":{"$error":"#N/A"}}]
["Establishing","Potential disadvantages: management challenges","Cock's foot",null,null,{"$f":"HLOOKUP(Table1[[#This Row],[Catch crop]], Tool!C$29:M$29,1,0)","v":{"$error":"#N/A"}}]
["Killing by tillage","Potential disadvantages: management challenges","Cock's foot",null,null,{"$f":"HLOOKUP(Table1[[#This Row],[Catch crop]], Tool!C$29:M$29,1,0)","v":{"$error":"#N/A"}}]
["Killing by mow","Potential disadvantages: management challenges","Cock's foot",null,null,{"$f":"HLOOKUP(Table1[[#This Row],[Catch crop]], Tool!C$29:M$29,1,0)","v":{"$error":"#N/A"}}]
["Incorporation of mature stand","Potential disadvantages: management challenges","Cock's foot",null,null,{"$f":"HLOOKUP(Table1[[#This Row],[Catch crop]], Tool!C$29:M$29,1,0)","v":{"$error":"#N/A"}}]
["Store excess N","Performance and role","Oat and black oat","Very good",3,{"$f":"HLOOKUP(Table1[[#This Row],[Catch crop]], Tool!C$29:M$29,1,0)","v":{"$error":"#N/A"}}]
["Organic matter improvement","Performance and role","Oat and black oat","Good",2,{"$f":"HLOOKUP(Table1[[#This Row],[Catch crop]], Tool!C$29:M$29,1,0)","v":{"$error":"#N/A"}}]
["Erosion fighter","Performance and role","Oat and black oat","Very good",3,{"$f":"HLOOKUP(Table1[[#This Row],[Catch crop]], Tool!C$29:M$29,1,0)","v":{"$error":"#N/A"}}]
["Weed fighter","Performance and role","Oat and black oat","Excellent",4,{"$f":"HLOOKUP(Table1[[#This Row],[Catch crop]], Tool!C$29:M$29,1,0)","v":{"$error":"#N/A"}}]
["Good grazing","Performance and role","Oat and black oat","Good",2,{"$f":"HLOOKUP(Table1[[#This Row],[Catch crop]], Tool!C$29:M$29,1,0)","v":{"$error":"#N/A"}}]
["Quick growth","Performance and role","Oat and black oat","Excellent",4,{"$f":"HLOOKUP(Table1[[#This Row],[Catch crop]], Tool!C$29:M$29,1,0)","v":{"$error":"#N/A"}}]
["Lasting residue","Performance and role","Oat and black oat","Good",2,{"$f":"HLOOKUP(Table1[[#This Row],[Catch crop]], Tool!C$29:M$29,1,0)","v":{"$error":"#N/A"}}]
["Length of vegetative stage","Performance and role","Oat and black oat","Fair",1,{"$f":"HLOOKUP(Table1[[#This Row],[Catch crop]], Tool!C$29:M$29,1,0)","v":{"$error":"#N/A"}}]
["Serving as a companion crop","Performance and role","Oat and black oat","Excellent",4,{"$f":"HLOOKUP(Table1[[#This Row],[Catch crop]], Tool!C$29:M$29,1,0)","v":{"$error":"#N/A"}}]
["Cold/frost resistance","Tolerances","Oat and black oat","Poor",0,{"$f":"HLOOKUP(Table1[[#This Row],[Catch crop]], Tool!C$29:M$29,1,0)","v":{"$error":"#N/A"}}]
["Tolerance to heat","Tolerances","Oat and black oat","Fair",1,{"$f":"HLOOKUP(Table1[[#This Row],[Catch crop]], Tool!C$29:M$29,1,0)","v":{"$error":"#N/A"}}]
["Tolerance to drought","Tolerances","Oat and black oat","Fair",1,{"$f":"HLOOKUP(Table1[[#This Row],[Catch crop]], Tool!C$29:M$29,1,0)","v":{"$error":"#N/A"}}]
["Tolerance to shade","Tolerances","Oat and black oat","Fair",1,{"$f":"HLOOKUP(Table1[[#This Row],[Catch crop]], Tool!C$29:M$29,1,0)","v":{"$error":"#N/A"}}]
["Tolerance to flood","Tolerances","Oat and black oat","Good",2,{"$f":"HLOOKUP(Table1[[#This Row],[Catch crop]], Tool!C$29:M$29,1,0)","v":{"$error":"#N/A"}}]
["Tolerance to low fertility","Tolerances","Oat and black oat","Good",2,{"$f":"HLOOKUP(Table1[[#This Row],[Catch crop]], Tool!C$29:M$29,1,0)","v":{"$error":"#N/A"}}]
["Min. germination temperature, C","Tolerances","Oat and black oat",null,3.3,{"$f":"HLOOKUP(Table1[[#This Row],[Catch crop]], Tool!C$29:M$29,1,0)","v":{"$error":"#N/A"}}]
["Subsoiler","Potential advantages: soil impact","Oat and black oat","Poor",0,{"$f":"HLOOKUP(Table1[[#This Row],[Catch crop]], Tool!C$29:M$29,1,0)","v":{"$error":"#N/A"}}]
["Free P and K","Potential advantages: soil impact","Oat and black oat","Fair",1,{"$f":"HLOOKUP(Table1[[#This Row],[Catch crop]], Tool!C$29:M$29,1,0)","v":{"$error":"#N/A"}}]
["Loosen topsoil","Potential advantages: soil impact","Oat and black oat","Very good",3,{"$f":"HLOOKUP(Table1[[#This Row],[Catch crop]], Tool!C$29:M$29,1,0)","v":{"$error":"#N/A"}}]
["Nematodes","Potential advantages: soil ecology","Oat and black oat","Poor",0,{"$f":"HLOOKUP(Table1[[#This Row],[Catch crop]], Tool!C$29:M$29,1,0)","v":{"$error":"#N/A"}}]
["Disease","Potential advantages: soil ecology","Oat and black oat","Good",2,{"$f":"HLOOKUP(Table1[[#This Row],[Catch crop]], Tool!C$29:M$29,1,0)","v":{"$error":"#N/A"}}]
["Allelopathic","Potential advantages: soil ecology","Oat and black oat","Very good",3,{"$f":"HLOOKUP(Table1[[#This Row],[Catch crop]], Tool!C$29:M$29,1,0)","v":{"$error":"#N/A"}}]
["Choke weeds","Potential advantages: soil ecology","Oat and black oat","Excellent",4,{"$f":"HLOOKUP(Table1[[#This Row],[Catch crop]], Tool!C$29:M$29,1,0)","v":{"$error":"#N/A"}}]
["Attract beneficials","Potential advantages: other","Oat and black oat","Poor",0,{"$f":"HLOOKUP(Table1[[#This Row],[Catch crop]], Tool!C$29:M$29,1,0)","v":{"$error":"#N/A"}}]
["Bears traffic","Potential advantages: other","Oat and black oat","Good",2,{"$f":"HLOOKUP(Table1[[#This Row],[Catch crop]], Tool!C$29:M$29,1,0)","v":{"$error":"#N/A"}}]
["Short windows","Potential advantages: other","Oat and black oat","Excellent",4,{"$f":"HLOOKUP(Table1[[#This Row],[Catch crop]], Tool!C$29:M$29,1,0)","v":{"$error":"#N/A"}}]
["Weed potential","Potential disadvantages: increase pest risks","Oat and black oat","Occasionally a minor problem",3,{"$f":"HLOOKUP(Table1[[#This Row],[Catch crop]], Tool!C$29:M$29,1,0)","v":{"$error":"#N/A"}}]
["Insects/ nematodes","Potential disadvantages: increase pest risks","Oat and black oat","Could be a minor problem",2,{"$f":"HLOOKUP(Table1[[#This Row],[Catch crop]], Tool!C$29:M$29,1,0)","v":{"$error":"#N/A"}}]
["Crop disease","Potential disadvantages: increase pest risks","Oat and black oat","Occasionally a minor problem",3,{"$f":"HLOOKUP(Table1[[#This Row],[Catch crop]], Tool!C$29:M$29,1,0)","v":{"$error":"#N/A"}}]
["Hinder crops","Potential disadvantages: management challenges","Oat and black oat","Could be a minor problem",2,{"$f":"HLOOKUP(Table1[[#This Row],[Catch crop]], Tool!C$29:M$29,1,0)","v":{"$error":"#N/A"}}]
["Establishing","Potential disadvantages: management challenges","Oat and black oat","Not a problem",4,{"$f":"HLOOKUP(Table1[[#This Row],[Catch crop]], Tool!C$29:M$29,1,0)","v":{"$error":"#N/A"}}]
["Killing by tillage","Potential disadvantages: management challenges","Oat and black oat","Not a problem",4,{"$f":"HLOOKUP(Table1[[#This Row],[Catch crop]], Tool!C$29:M$29,1,0)","v":{"$error":"#N/A"}}]
["Killing by mow","Potential disadvantages: management challenges","Oat and black oat","Could be a moderate problem",1,{"$f":"HLOOKUP(Table1[[#This Row],[Catch crop]], Tool!C$29:M$29,1,0)","v":{"$error":"#N/A"}}]
["Incorporation of mature stand","Potential disadvantages: management challenges","Oat and black oat","Could be a minor problem",2,{"$f":"HLOOKUP(Table1[[#This Row],[Catch crop]], Tool!C$29:M$29,1,0)","v":{"$error":"#N/A"}}]
["Store excess N","Performance and role","Buckwheat","Poor",0,{"$f":"HLOOKUP(Table1[[#This Row],[Catch crop]], Tool!C$29:M$29,1,0)","v":{"$error":"#N/A"}}]
["Organic matter improvement","Performance and role","Buckwheat","Good",2,{"$f":"HLOOKUP(Table1[[#This Row],[Catch crop]], Tool!C$29:M$29,1,0)","v":{"$error":"#N/A"}}]
["Erosion fighter","Performance and role","Buckwheat","Fair",1,{"$f":"HLOOKUP(Table1[[#This Row],[Catch crop]], Tool!C$29:M$29,1,0)","v":{"$error":"#N/A"}}]
["Weed fighter","Performance and role","Buckwheat","Excellent",4,{"$f":"HLOOKUP(Table1[[#This Row],[Catch crop]], Tool!C$29:M$29,1,0)","v":{"$error":"#N/A"}}]
["Good grazing","Performance and role","Buckwheat","Poor",0,{"$f":"HLOOKUP(Table1[[#This Row],[Catch crop]], Tool!C$29:M$29,1,0)","v":{"$error":"#N/A"}}]
["Quick growth","Performance and role","Buckwheat","Excellent",4,{"$f":"HLOOKUP(Table1[[#This Row],[Catch crop]], Tool!C$29:M$29,1,0)","v":{"$error":"#N/A"}}]
["Lasting residue","Performance and role","Buckwheat","Poor",0,{"$f":"HLOOKUP(Table1[[#This Row],[Catch crop]], Tool!C$29:M$29,1,0)","v":{"$error":"#N/A"}}]
["Length of vegetative stage","Performance and role","Buckwheat","Fair",1,{"$f":"HLOOKUP(Table1[[#This Row],[Catch crop]], Tool!C$29:M$29,1,0)","v":{"$error":"#N/A"}}]
["Serving as a companion crop","Performance and role","Buckwheat","Excellent",4,{"$f":"HLOOKUP(Table1[[#This Row],[Catch crop]], Tool!C$29:M$29,1,0)","v":{"$error":"#N/A"}}]
["Cold/frost resistance","Tolerances","Buckwheat",null,null,{"$f":"HLOOKUP(Table1[[#This Row],[Catch crop]], Tool!C$29:M$29,1,0)","v":{"$error":"#N/A"}}]
["Tolerance to heat","Tolerances","Buckwheat","Good",2,{"$f":"HLOOKUP(Table1[[#This Row],[Catch crop]], Tool!C$29:M$29,1,0)","v":{"$error":"#N/A"}}]
["Tolerance to drought","Tolerances","Buckwheat","Poor",0,{"$f":"HLOOKUP(Table1[[#This Row],[Catch crop]], Tool!C$29:M$29,1,0)","v":{"$error":"#N/A"}}]
["Tolerance to shade","Tolerances","Buckwheat","Fair",1,{"$f":"HLOOKUP(Table1[[#This Row],[Catch crop]], Tool!C$29:M$29,1,0)","v":{"$error":"#N/A"}}]
["Tolerance to flood","Tolerances","Buckwheat","Fair",1,{"$f":"HLOOKUP(Table1[[#This Row],[Catch crop]], Tool!C$29:M$29,1,0)","v":{"$error":"#N/A"}}]
["Tolerance to low fertility","Tolerances","Buckwheat","Fair",1,{"$f":"HLOOKUP(Table1[[#This Row],[Catch crop]], Tool!C$29:M$29,1,0)","v":{"$error":"#N/A"}}]
["Min. germination temperature, C","Tolerances","Buckwheat",null,10,{"$f":"HLOOKUP(Table1[[#This Row],[Catch crop]], Tool!C$29:M$29,1,0)","v":{"$error":"#N/A"}}]
["Subsoiler","Potential advantages: soil impact","Buckwheat","Poor",0,{"$f":"HLOOKUP(Table1[[#This Row],[Catch crop]], Tool!C$29:M$29,1,0)","v":{"$error":"#N/A"}}]
["Free P and K","Potential advantages: soil impact","Buckwheat","Excellent",4,{"$f":"HLOOKUP(Table1[[#This Row],[Catch crop]], Tool!C$29:M$29,1,0)","v":{"$error":"#N/A"}}]
["Loosen topsoil","Potential advantages: soil impact","Buckwheat","Very good",3,{"$f":"HLOOKUP(Table1[[#This Row],[Catch crop]], Tool!C$29:M$29,1,0)","v":{"$error":"#N/A"}}]
["Nematodes","Potential advantages: soil ecology","Buckwheat","Fair",1,{"$f":"HLOOKUP(Table1[[#This Row],[Catch crop]], Tool!C$29:M$29,1,0)","v":{"$error":"#N/A"}}]
["Disease","Potential advantages: soil ecology","Buckwheat","Poor",0,{"$f":"HLOOKUP(Table1[[#This Row],[Catch crop]], Tool!C$29:M$29,1,0)","v":{"$error":"#N/A"}}]
["Allelopathic","Potential advantages: soil ecology","Buckwheat","Very good",3,{"$f":"HLOOKUP(Table1[[#This Row],[Catch crop]], Tool!C$29:M$29,1,0)","v":{"$error":"#N/A"}}]
["Choke weeds","Potential advantages: soil ecology","Buckwheat","Excellent",4,{"$f":"HLOOKUP(Table1[[#This Row],[Catch crop]], Tool!C$29:M$29,1,0)","v":{"$error":"#N/A"}}]
["Attract beneficials","Potential advantages: other","Buckwheat","Excellent",4,{"$f":"HLOOKUP(Table1[[#This Row],[Catch crop]], Tool!C$29:M$29,1,0)","v":{"$error":"#N/A"}}]
["Bears traffic","Potential advantages: other","Buckwheat","Poor",0,{"$f":"HLOOKUP(Table1[[#This Row],[Catch crop]], Tool!C$29:M$29,1,0)","v":{"$error":"#N/A"}}]
["Short windows","Potential advantages: other","Buckwheat","Excellent",4,{"$f":"HLOOKUP(Table1[[#This Row],[Catch crop]], Tool!C$29:M$29,1,0)","v":{"$error":"#N/A"}}]
["Weed potential","Potential disadvantages: increase pest risks","Buckwheat","Problem",0,{"$f":"HLOOKUP(Table1[[#This Row],[Catch crop]], Tool!C$29:M$29,1,0)","v":{"$error":"#N/A"}}]
["Insects/ nematodes","Potential disadvantages: increase pest risks","Buckwheat","Occasionally a minor problem",3,{"$f":"HLOOKUP(Table1[[#This Row],[Catch crop]], Tool!C$29:M$29,1,0)","v":{"$error":"#N/A"}}]
["Crop disease","Potential disadvantages: increase pest risks","Buckwheat","Not a problem",4,{"$f":"HLOOKUP(Table1[[#This Row],[Catch crop]], Tool!C$29:M$29,1,0)","v":{"$error":"#N/A"}}]
["Hinder crops","Potential disadvantages: management challenges","Buckwheat","Not a problem",4,{"$f":"HLOOKUP(Table1[[#This Row],[Catch crop]], Tool!C$29:M$29,1,0)","v":{"$error":"#N/A"}}]
["Establishing","Potential disadvantages: management challenges","Buckwheat","Not a problem",4,{"$f":"HLOOKUP(Table1[[#This Row],[Catch crop]], Tool!C$29:M$29,1,0)","v":{"$error":"#N/A"}}]
["Killing by tillage","Potential disadvantages: management challenges","Buckwheat","Not a problem",4,{"$f":"HLOOKUP(Table1[[#This Row],[Catch crop]], Tool!C$29:M$29,1,0)","v":{"$error":"#N/A"}}]
["Killing by mow","Potential disadvantages: management challenges","Buckwheat","Not a problem",4,{"$f":"HLOOKUP(Table1[[#This Row],[Catch crop]], Tool!C$29:M$29,1,0)","v":{"$error":"#N/A"}}]
["Incorporation of mature stand","Potential disadvantages: management challenges","Buckwheat","Not a problem",4,{"$f":"HLOOKUP(Table1[[#This Row],[Catch crop]], Tool!C$29:M$29,1,0)","v":{"$error":"#N/A"}}]
["Store excess N","Performance and role","Winter vetch","Fair",1,{"$f":"HLOOKUP(Table1[[#This Row],[Catch crop]], Tool!C$29:M$29,1,0)","v":{"$error":"#N/A"}}]
["Organic matter improvement","Performance and role","Winter vetch","Very good",3,{"$f":"HLOOKUP(Table1[[#This Row],[Catch crop]], Tool!C$29:M$29,1,0)","v":{"$error":"#N/A"}}]
["Erosion fighter","Performance and role","Winter vetch","Good",2,{"$f":"HLOOKUP(Table1[[#This Row],[Catch crop]], Tool!C$29:M$29,1,0)","v":{"$error":"#N/A"}}]
["Weed fighter","Performance and role","Winter vetch","Good",2,{"$f":"HLOOKUP(Table1[[#This Row],[Catch crop]], Tool!C$29:M$29,1,0)","v":{"$error":"#N/A"}}]
["Good grazing","Performance and role","Winter vetch","Good",2,{"$f":"HLOOKUP(Table1[[#This Row],[Catch crop]], Tool!C$29:M$29,1,0)","v":{"$error":"#N/A"}}]
["Quick growth","Performance and role","Winter vetch","Fair",1,{"$f":"HLOOKUP(Table1[[#This Row],[Catch crop]], Tool!C$29:M$29,1,0)","v":{"$error":"#N/A"}}]
["Lasting residue","Performance and role","Winter vetch","Fair",1,{"$f":"HLOOKUP(Table1[[#This Row],[Catch crop]], Tool!C$29:M$29,1,0)","v":{"$error":"#N/A"}}]
["Length of vegetative stage","Performance and role","Winter vetch","Very good",3,{"$f":"HLOOKUP(Table1[[#This Row],[Catch crop]], Tool!C$29:M$29,1,0)","v":{"$error":"#N/A"}}]
["Serving as a companion crop","Performance and role","Winter vetch","Good",2,{"$f":"HLOOKUP(Table1[[#This Row],[Catch crop]], Tool!C$29:M$29,1,0)","v":{"$error":"#N/A"}}]
["Cold/frost resistance","Tolerances","Winter vetch","Excellent",4,{"$f":"HLOOKUP(Table1[[#This Row],[Catch crop]], Tool!C$29:M$29,1,0)","v":{"$error":"#N/A"}}]
["Tolerance to heat","Tolerances","Winter vetch","Fair",1,{"$f":"HLOOKUP(Table1[[#This Row],[Catch crop]], Tool!C$29:M$29,1,0)","v":{"$error":"#N/A"}}]
["Tolerance to drought","Tolerances","Winter vetch","Good",2,{"$f":"HLOOKUP(Table1[[#This Row],[Catch crop]], Tool!C$29:M$29,1,0)","v":{"$error":"#N/A"}}]
["Tolerance to shade","Tolerances","Winter vetch","Good",2,{"$f":"HLOOKUP(Table1[[#This Row],[Catch crop]], Tool!C$29:M$29,1,0)","v":{"$error":"#N/A"}}]
["Tolerance to flood","Tolerances","Winter vetch","Fair",1,{"$f":"HLOOKUP(Table1[[#This Row],[Catch crop]], Tool!C$29:M$29,1,0)","v":{"$error":"#N/A"}}]
["Tolerance to low fertility","Tolerances","Winter vetch","Fair",1,{"$f":"HLOOKUP(Table1[[#This Row],[Catch crop]], Tool!C$29:M$29,1,0)","v":{"$error":"#N/A"}}]
["Min. germination temperature, C","Tolerances","Winter vetch",null,15.6,{"$f":"HLOOKUP(Table1[[#This Row],[Catch crop]], Tool!C$29:M$29,1,0)","v":{"$error":"#N/A"}}]
["Subsoiler","Potential advantages: soil impact","Winter vetch","Good",2,{"$f":"HLOOKUP(Table1[[#This Row],[Catch crop]], Tool!C$29:M$29,1,0)","v":{"$error":"#N/A"}}]
["Free P and K","Potential advantages: soil impact","Winter vetch","Good",2,{"$f":"HLOOKUP(Table1[[#This Row],[Catch crop]], Tool!C$29:M$29,1,0)","v":{"$error":"#N/A"}}]
["Loosen topsoil","Potential advantages: soil impact","Winter vetch","Very good",3,{"$f":"HLOOKUP(Table1[[#This Row],[Catch crop]], Tool!C$29:M$29,1,0)","v":{"$error":"#N/A"}}]
["Nematodes","Potential advantages: soil ecology","Winter vetch","Fair",1,{"$f":"HLOOKUP(Table1[[#This Row],[Catch crop]], Tool!C$29:M$29,1,0)","v":{"$error":"#N/A"}}]
["Disease","Potential advantages: soil ecology","Winter vetch","Good",2,{"$f":"HLOOKUP(Table1[[#This Row],[Catch crop]], Tool!C$29:M$29,1,0)","v":{"$error":"#N/A"}}]
["Allelopathic","Potential advantages: soil ecology","Winter vetch","Good",2,{"$f":"HLOOKUP(Table1[[#This Row],[Catch crop]], Tool!C$29:M$29,1,0)","v":{"$error":"#N/A"}}]
["Choke weeds","Potential advantages: soil ecology","Winter vetch","Very good",3,{"$f":"HLOOKUP(Table1[[#This Row],[Catch crop]], Tool!C$29:M$29,1,0)","v":{"$error":"#N/A"}}]
["Attract beneficials","Potential advantages: other","Winter vetch","Excellent",4,{"$f":"HLOOKUP(Table1[[#This Row],[Catch crop]], Tool!C$29:M$29,1,0)","v":{"$error":"#N/A"}}]
["Bears traffic","Potential advantages: other","Winter vetch","Poor",0,{"$f":"HLOOKUP(Table1[[#This Row],[Catch crop]], Tool!C$29:M$29,1,0)","v":{"$error":"#N/A"}}]
["Short windows","Potential advantages: other","Winter vetch","Poor",0,{"$f":"HLOOKUP(Table1[[#This Row],[Catch crop]], Tool!C$29:M$29,1,0)","v":{"$error":"#N/A"}}]
["Weed potential","Potential disadvantages: increase pest risks","Winter vetch","Could be a minor problem",2,{"$f":"HLOOKUP(Table1[[#This Row],[Catch crop]], Tool!C$29:M$29,1,0)","v":{"$error":"#N/A"}}]
["Insects/ nematodes","Potential disadvantages: increase pest risks","Winter vetch","Could be a minor problem",2,{"$f":"HLOOKUP(Table1[[#This Row],[Catch crop]], Tool!C$29:M$29,1,0)","v":{"$error":"#N/A"}}]
["Crop disease","Potential disadvantages: increase pest risks","Winter vetch","Not a problem",4,{"$f":"HLOOKUP(Table1[[#This Row],[Catch crop]], Tool!C$29:M$29,1,0)","v":{"$error":"#N/A"}}]
["Hinder crops","Potential disadvantages: management challenges","Winter vetch","Not a problem",4,{"$f":"HLOOKUP(Table1[[#This Row],[Catch crop]], Tool!C$29:M$29,1,0)","v":{"$error":"#N/A"}}]
["Establishing","Potential disadvantages: management challenges","Winter vetch","Could be a minor problem",2,{"$f":"HLOOKUP(Table1[[#This Row],[Catch crop]], Tool!C$29:M$29,1,0)","v":{"$error":"#N/A"}}]
["Killing by tillage","Potential disadvantages: management challenges","Winter vetch","Could be a moderate problem",1,{"$f":"HLOOKUP(Table1[[#This Row],[Catch crop]], Tool!C$29:M$29,1,0)","v":{"$error":"#N/A"}}]
["Killing by mow","Potential disadvantages: management challenges","Winter vetch","Not a problem",4,{"$f":"HLOOKUP(Table1[[#This Row],[Catch crop]], Tool!C$29:M$29,1,0)","v":{"$error":"#N/A"}}]
["Incorporation of mature stand","Potential disadvantages: management challenges","Winter vetch","Could be a minor problem",2,{"$f":"HLOOKUP(Table1[[#This Row],[Catch crop]], Tool!C$29:M$29,1,0)","v":{"$error":"#N/A"}}]
["Store excess N","Performance and role","Pea","Fair",1,{"$f":"HLOOKUP(Table1[[#This Row],[Catch crop]], Tool!C$29:M$29,1,0)","v":{"$error":"#N/A"}}]
["Organic matter improvement","Performance and role","Pea","Good",2,{"$f":"HLOOKUP(Table1[[#This Row],[Catch crop]], Tool!C$29:M$29,1,0)","v":{"$error":"#N/A"}}]
["Erosion fighter","Performance and role","Pea","Very good",3,{"$f":"HLOOKUP(Table1[[#This Row],[Catch crop]], Tool!C$29:M$29,1,0)","v":{"$error":"#N/A"}}]
["Weed fighter","Performance and role","Pea","Good",2,{"$f":"HLOOKUP(Table1[[#This Row],[Catch crop]], Tool!C$29:M$29,1,0)","v":{"$error":"#N/A"}}]
["Good grazing","Performance and role","Pea","Very good",3,{"$f":"HLOOKUP(Table1[[#This Row],[Catch crop]], Tool!C$29:M$29,1,0)","v":{"$error":"#N/A"}}]
["Quick growth","Performance and role","Pea","Very good",3,{"$f":"HLOOKUP(Table1[[#This Row],[Catch crop]], Tool!C$29:M$29,1,0)","v":{"$error":"#N/A"}}]
["Lasting residue","Performance and role","Pea","Fair",1,{"$f":"HLOOKUP(Table1[[#This Row],[Catch crop]], Tool!C$29:M$29,1,0)","v":{"$error":"#N/A"}}]
["Length of vegetative stage","Performance and role","Pea","Good",2,{"$f":"HLOOKUP(Table1[[#This Row],[Catch crop]], Tool!C$29:M$29,1,0)","v":{"$error":"#N/A"}}]
["Serving as a companion crop","Performance and role","Pea","Excellent",4,{"$f":"HLOOKUP(Table1[[#This Row],[Catch crop]], Tool!C$29:M$29,1,0)","v":{"$error":"#N/A"}}]
["Cold/frost resistance","Tolerances","Pea","Poor",0,{"$f":"HLOOKUP(Table1[[#This Row],[Catch crop]], Tool!C$29:M$29,1,0)","v":{"$error":"#N/A"}}]
["Tolerance to heat","Tolerances","Pea","Fair",1,{"$f":"HLOOKUP(Table1[[#This Row],[Catch crop]], Tool!C$29:M$29,1,0)","v":{"$error":"#N/A"}}]
["Tolerance to drought","Tolerances","Pea","Good",2,{"$f":"HLOOKUP(Table1[[#This Row],[Catch crop]], Tool!C$29:M$29,1,0)","v":{"$error":"#N/A"}}]
["Tolerance to shade","Tolerances","Pea","Fair",1,{"$f":"HLOOKUP(Table1[[#This Row],[Catch crop]], Tool!C$29:M$29,1,0)","v":{"$error":"#N/A"}}]
["Tolerance to flood","Tolerances","Pea","Fair",1,{"$f":"HLOOKUP(Table1[[#This Row],[Catch crop]], Tool!C$29:M$29,1,0)","v":{"$error":"#N/A"}}]
["Tolerance to low fertility","Tolerances","Pea","Fair",1,{"$f":"HLOOKUP(Table1[[#This Row],[Catch crop]], Tool!C$29:M$29,1,0)","v":{"$error":"#N/A"}}]
["Min. germination temperature, C","Tolerances","Pea",null,5,{"$f":"HLOOKUP(Table1[[#This Row],[Catch crop]], Tool!C$29:M$29,1,0)","v":{"$error":"#N/A"}}]
["Subsoiler","Potential advantages: soil impact","Pea","Fair",1,{"$f":"HLOOKUP(Table1[[#This Row],[Catch crop]], Tool!C$29:M$29,1,0)","v":{"$error":"#N/A"}}]
["Free P and K","Potential advantages: soil impact","Pea","Fair",1,{"$f":"HLOOKUP(Table1[[#This Row],[Catch crop]], Tool!C$29:M$29,1,0)","v":{"$error":"#N/A"}}]
["Loosen topsoil","Potential advantages: soil impact","Pea","Very good",3,{"$f":"HLOOKUP(Table1[[#This Row],[Catch crop]], Tool!C$29:M$29,1,0)","v":{"$error":"#N/A"}}]
["Nematodes","Potential advantages: soil ecology","Pea","Good",2,{"$f":"HLOOKUP(Table1[[#This Row],[Catch crop]], Tool!C$29:M$29,1,0)","v":{"$error":"#N/A"}}]
["Disease","Potential advantages: soil ecology","Pea","Very good",3,{"$f":"HLOOKUP(Table1[[#This Row],[Catch crop]], Tool!C$29:M$29,1,0)","v":{"$error":"#N/A"}}]
["Allelopathic","Potential advantages: soil ecology","Pea","Fair",1,{"$f":"HLOOKUP(Table1[[#This Row],[Catch crop]], Tool!C$29:M$29,1,0)","v":{"$error":"#N/A"}}]
["Choke weeds","Potential advantages: soil ecology","Pea","Very good",3,{"$f":"HLOOKUP(Table1[[#This Row],[Catch crop]], Tool!C$29:M$29,1,0)","v":{"$error":"#N/A"}}]
["Attract beneficials","Potential advantages: other","Pea","Very good",3,{"$f":"HLOOKUP(Table1[[#This Row],[Catch crop]], Tool!C$29:M$29,1,0)","v":{"$error":"#N/A"}}]
["Bears traffic","Potential advantages: other","Pea","Fair",1,{"$f":"HLOOKUP(Table1[[#This Row],[Catch crop]], Tool!C$29:M$29,1,0)","v":{"$error":"#N/A"}}]
["Short windows","Potential advantages: other","Pea","Very good",3,{"$f":"HLOOKUP(Table1[[#This Row],[Catch crop]], Tool!C$29:M$29,1,0)","v":{"$error":"#N/A"}}]
["Weed potential","Potential disadvantages: increase pest risks","Pea","Not a problem",4,{"$f":"HLOOKUP(Table1[[#This Row],[Catch crop]], Tool!C$29:M$29,1,0)","v":{"$error":"#N/A"}}]
["Insects/ nematodes","Potential disadvantages: increase pest risks","Pea","Could be a minor problem",2,{"$f":"HLOOKUP(Table1[[#This Row],[Catch crop]], Tool!C$29:M$29,1,0)","v":{"$error":"#N/A"}}]
["Crop disease","Potential disadvantages: increase pest risks","Pea","Could be a moderate problem",1,{"$f":"HLOOKUP(Table1[[#This Row],[Catch crop]], Tool!C$29:M$29,1,0)","v":{"$error":"#N/A"}}]
["Hinder crops","Potential disadvantages: management challenges","Pea","Not a problem",4,{"$f":"HLOOKUP(Table1[[#This Row],[Catch crop]], Tool!C$29:M$29,1,0)","v":{"$error":"#N/A"}}]
["Establishing","Potential disadvantages: management challenges","Pea","Not a problem",4,{"$f":"HLOOKUP(Table1[[#This Row],[Catch crop]], Tool!C$29:M$29,1,0)","v":{"$error":"#N/A"}}]
["Killing by tillage","Potential disadvantages: management challenges","Pea","Not a problem",4,{"$f":"HLOOKUP(Table1[[#This Row],[Catch crop]], Tool!C$29:M$29,1,0)","v":{"$error":"#N/A"}}]
["Killing by mow","Potential disadvantages: management challenges","Pea","Not a problem",4,{"$f":"HLOOKUP(Table1[[#This Row],[Catch crop]], Tool!C$29:M$29,1,0)","v":{"$error":"#N/A"}}]
["Incorporation of mature stand","Potential disadvantages: management challenges","Pea","Occasionally a minor problem",3,{"$f":"HLOOKUP(Table1[[#This Row],[Catch crop]], Tool!C$29:M$29,1,0)","v":{"$error":"#N/A"}}]
["Store excess N","Performance and role","Blue bitter lupine",null,null,{"$f":"HLOOKUP(Table1[[#This Row],[Catch crop]], Tool!C$29:M$29,1,0)","v":{"$error":"#N/A"}}]
["Organic matter improvement","Performance and role","Blue bitter lupine",null,null,{"$f":"HLOOKUP(Table1[[#This Row],[Catch crop]], Tool!C$29:M$29,1,0)","v":{"$error":"#N/A"}}]
["Erosion fighter","Performance and role","Blue bitter lupine",null,null,{"$f":"HLOOKUP(Table1[[#This Row],[Catch crop]], Tool!C$29:M$29,1,0)","v":{"$error":"#N/A"}}]
["Weed fighter","Performance and role","Blue bitter lupine",null,null,{"$f":"HLOOKUP(Table1[[#This Row],[Catch crop]], Tool!C$29:M$29,1,0)","v":{"$error":"#N/A"}}]
["Good grazing","Performance and role","Blue bitter lupine",null,null,{"$f":"HLOOKUP(Table1[[#This Row],[Catch crop]], Tool!C$29:M$29,1,0)","v":{"$error":"#N/A"}}]
["Quick growth","Performance and role","Blue bitter lupine",null,null,{"$f":"HLOOKUP(Table1[[#This Row],[Catch crop]], Tool!C$29:M$29,1,0)","v":{"$error":"#N/A"}}]
["Lasting residue","Performance and role","Blue bitter lupine",null,null,{"$f":"HLOOKUP(Table1[[#This Row],[Catch crop]], Tool!C$29:M$29,1,0)","v":{"$error":"#N/A"}}]
["Length of vegetative stage","Performance and role","Blue bitter lupine",null,null,{"$f":"HLOOKUP(Table1[[#This Row],[Catch crop]], Tool!C$29:M$29,1,0)","v":{"$error":"#N/A"}}]
["Serving as a companion crop","Performance and role","Blue bitter lupine",null,null,{"$f":"HLOOKUP(Table1[[#This Row],[Catch crop]], Tool!C$29:M$29,1,0)","v":{"$error":"#N/A"}}]
["Cold/frost resistance","Tolerances","Blue bitter lupine",null,null,{"$f":"HLOOKUP(Table1[[#This Row],[Catch crop]], Tool!C$29:M$29,1,0)","v":{"$error":"#N/A"}}]
["Tolerance to heat","Tolerances","Blue bitter lupine",null,null,{"$f":"HLOOKUP(Table1[[#This Row],[Catch crop]], Tool!C$29:M$29,1,0)","v":{"$error":"#N/A"}}]
["Tolerance to drought","Tolerances","Blue bitter lupine",null,null,{"$f":"HLOOKUP(Table1[[#This Row],[Catch crop]], Tool!C$29:M$29,1,0)","v":{"$error":"#N/A"}}]
["Tolerance to shade","Tolerances","Blue bitter lupine",null,null,{"$f":"HLOOKUP(Table1[[#This Row],[Catch crop]], Tool!C$29:M$29,1,0)","v":{"$error":"#N/A"}}]
["Tolerance to flood","Tolerances","Blue bitter lupine",null,null,{"$f":"HLOOKUP(Table1[[#This Row],[Catch crop]], Tool!C$29:M$29,1,0)","v":{"$error":"#N/A"}}]
["Tolerance to low fertility","Tolerances","Blue bitter lupine",null,null,{"$f":"HLOOKUP(Table1[[#This Row],[Catch crop]], Tool!C$29:M$29,1,0)","v":{"$error":"#N/A"}}]
["Min. germination temperature, C","Tolerances","Blue bitter lupine",null,null,{"$f":"HLOOKUP(Table1[[#This Row],[Catch crop]], Tool!C$29:M$29,1,0)","v":{"$error":"#N/A"}}]
["Subsoiler","Potential advantages: soil impact","Blue bitter lupine",null,null,{"$f":"HLOOKUP(Table1[[#This Row],[Catch crop]], Tool!C$29:M$29,1,0)","v":{"$error":"#N/A"}}]
["Free P and K","Potential advantages: soil impact","Blue bitter lupine",null,null,{"$f":"HLOOKUP(Table1[[#This Row],[Catch crop]], Tool!C$29:M$29,1,0)","v":{"$error":"#N/A"}}]
["Loosen topsoil","Potential advantages: soil impact","Blue bitter lupine",null,null,{"$f":"HLOOKUP(Table1[[#This Row],[Catch crop]], Tool!C$29:M$29,1,0)","v":{"$error":"#N/A"}}]
["Nematodes","Potential advantages: soil ecology","Blue bitter lupine",null,null,{"$f":"HLOOKUP(Table1[[#This Row],[Catch crop]], Tool!C$29:M$29,1,0)","v":{"$error":"#N/A"}}]
["Disease","Potential advantages: soil ecology","Blue bitter lupine",null,null,{"$f":"HLOOKUP(Table1[[#This Row],[Catch crop]], Tool!C$29:M$29,1,0)","v":{"$error":"#N/A"}}]
["Allelopathic","Potential advantages: soil ecology","Blue bitter lupine",null,null,{"$f":"HLOOKUP(Table1[[#This Row],[Catch crop]], Tool!C$29:M$29,1,0)","v":{"$error":"#N/A"}}]
["Choke weeds","Potential advantages: soil ecology","Blue bitter lupine",null,null,{"$f":"HLOOKUP(Table1[[#This Row],[Catch crop]], Tool!C$29:M$29,1,0)","v":{"$error":"#N/A"}}]
["Attract beneficials","Potential advantages: other","Blue bitter lupine",null,null,{"$f":"HLOOKUP(Table1[[#This Row],[Catch crop]], Tool!C$29:M$29,1,0)","v":{"$error":"#N/A"}}]
["Bears traffic","Potential advantages: other","Blue bitter lupine",null,null,{"$f":"HLOOKUP(Table1[[#This Row],[Catch crop]], Tool!C$29:M$29,1,0)","v":{"$error":"#N/A"}}]
["Short windows","Potential advantages: other","Blue bitter lupine",null,null,{"$f":"HLOOKUP(Table1[[#This Row],[Catch crop]], Tool!C$29:M$29,1,0)","v":{"$error":"#N/A"}}]
["Weed potential","Potential disadvantages: increase pest risks","Blue bitter lupine",null,null,{"$f":"HLOOKUP(Table1[[#This Row],[Catch crop]], Tool!C$29:M$29,1,0)","v":{"$error":"#N/A"}}]
["Insects/ nematodes","Potential disadvantages: increase pest risks","Blue bitter lupine",null,null,{"$f":"HLOOKUP(Table1[[#This Row],[Catch crop]], Tool!C$29:M$29,1,0)","v":{"$error":"#N/A"}}]
["Crop disease","Potential disadvantages: increase pest risks","Blue bitter lupine",null,null,{"$f":"HLOOKUP(Table1[[#This Row],[Catch crop]], Tool!C$29:M$29,1,0)","v":{"$error":"#N/A"}}]
["Hinder crops","Potential disadvantages: management challenges","Blue bitter lupine",null,null,{"$f":"HLOOKUP(Table1[[#This Row],[Catch crop]], Tool!C$29:M$29,1,0)","v":{"$error":"#N/A"}}]
["Establishing","Potential disadvantages: management challenges","Blue bitter lupine",null,null,{"$f":"HLOOKUP(Table1[[#This Row],[Catch crop]], Tool!C$29:M$29,1,0)","v":{"$error":"#N/A"}}]
["Killing by tillage","Potential disadvantages: management challenges","Blue bitter lupine",null,null,{"$f":"HLOOKUP(Table1[[#This Row],[Catch crop]], Tool!C$29:M$29,1,0)","v":{"$error":"#N/A"}}]
["Killing by mow","Potential disadvantages: management challenges","Blue bitter lupine",null,null,{"$f":"HLOOKUP(Table1[[#This Row],[Catch crop]], Tool!C$29:M$29,1,0)","v":{"$error":"#N/A"}}]
["Incorporation of mature stand","Potential disadvantages: management challenges","Blue bitter lupine",null,null,{"$f":"HLOOKUP(Table1[[#This Row],[Catch crop]], Tool!C$29:M$29,1,0)","v":{"$error":"#N/A"}}]
["Store excess N","Performance and role","Bean",null,null,{"$f":"HLOOKUP(Table1[[#This Row],[Catch crop]], Tool!C$29:M$29,1,0)","v":{"$error":"#N/A"}}]
["Organic matter improvement","Performance and role","Bean",null,null,{"$f":"HLOOKUP(Table1[[#This Row],[Catch crop]], Tool!C$29:M$29,1,0)","v":{"$error":"#N/A"}}]
["Erosion fighter","Performance and role","Bean",null,null,{"$f":"HLOOKUP(Table1[[#This Row],[Catch crop]], Tool!C$29:M$29,1,0)","v":{"$error":"#N/A"}}]
["Weed fighter","Performance and role","Bean",null,null,{"$f":"HLOOKUP(Table1[[#This Row],[Catch crop]], Tool!C$29:M$29,1,0)","v":{"$error":"#N/A"}}]
["Good grazing","Performance and role","Bean",null,null,{"$f":"HLOOKUP(Table1[[#This Row],[Catch crop]], Tool!C$29:M$29,1,0)","v":{"$error":"#N/A"}}]
["Quick growth","Performance and role","Bean",null,null,{"$f":"HLOOKUP(Table1[[#This Row],[Catch crop]], Tool!C$29:M$29,1,0)","v":{"$error":"#N/A"}}]
["Lasting residue","Performance and role","Bean",null,null,{"$f":"HLOOKUP(Table1[[#This Row],[Catch crop]], Tool!C$29:M$29,1,0)","v":{"$error":"#N/A"}}]
["Length of vegetative stage","Performance and role","Bean",null,null,{"$f":"HLOOKUP(Table1[[#This Row],[Catch crop]], Tool!C$29:M$29,1,0)","v":{"$error":"#N/A"}}]
["Serving as a companion crop","Performance and role","Bean",null,null,{"$f":"HLOOKUP(Table1[[#This Row],[Catch crop]], Tool!C$29:M$29,1,0)","v":{"$error":"#N/A"}}]
["Cold/frost resistance","Tolerances","Bean",null,null,{"$f":"HLOOKUP(Table1[[#This Row],[Catch crop]], Tool!C$29:M$29,1,0)","v":{"$error":"#N/A"}}]
["Tolerance to heat","Tolerances","Bean",null,null,{"$f":"HLOOKUP(Table1[[#This Row],[Catch crop]], Tool!C$29:M$29,1,0)","v":{"$error":"#N/A"}}]
["Tolerance to drought","Tolerances","Bean",null,null,{"$f":"HLOOKUP(Table1[[#This Row],[Catch crop]], Tool!C$29:M$29,1,0)","v":{"$error":"#N/A"}}]
["Tolerance to shade","Tolerances","Bean",null,null,{"$f":"HLOOKUP(Table1[[#This Row],[Catch crop]], Tool!C$29:M$29,1,0)","v":{"$error":"#N/A"}}]
["Tolerance to flood","Tolerances","Bean",null,null,{"$f":"HLOOKUP(Table1[[#This Row],[Catch crop]], Tool!C$29:M$29,1,0)","v":{"$error":"#N/A"}}]
["Tolerance to low fertility","Tolerances","Bean",null,null,{"$f":"HLOOKUP(Table1[[#This Row],[Catch crop]], Tool!C$29:M$29,1,0)","v":{"$error":"#N/A"}}]
["Min. germination temperature, C","Tolerances","Bean",null,null,{"$f":"HLOOKUP(Table1[[#This Row],[Catch crop]], Tool!C$29:M$29,1,0)","v":{"$error":"#N/A"}}]
["Subsoiler","Potential advantages: soil impact","Bean",null,null,{"$f":"HLOOKUP(Table1[[#This Row],[Catch crop]], Tool!C$29:M$29,1,0)","v":{"$error":"#N/A"}}]
["Free P and K","Potential advantages: soil impact","Bean",null,null,{"$f":"HLOOKUP(Table1[[#This Row],[Catch crop]], Tool!C$29:M$29,1,0)","v":{"$error":"#N/A"}}]
["Loosen topsoil","Potential advantages: soil impact","Bean",null,null,{"$f":"HLOOKUP(Table1[[#This Row],[Catch crop]], Tool!C$29:M$29,1,0)","v":{"$error":"#N/A"}}]
["Nematodes","Potential advantages: soil ecology","Bean",null,null,{"$f":"HLOOKUP(Table1[[#This Row],[Catch crop]], Tool!C$29:M$29,1,0)","v":{"$error":"#N/A"}}]
["Disease","Potential advantages: soil ecology","Bean",null,null,{"$f":"HLOOKUP(Table1[[#This Row],[Catch crop]], Tool!C$29:M$29,1,0)","v":{"$error":"#N/A"}}]
["Allelopathic","Potential advantages: soil ecology","Bean",null,null,{"$f":"HLOOKUP(Table1[[#This Row],[Catch crop]], Tool!C$29:M$29,1,0)","v":{"$error":"#N/A"}}]
["Choke weeds","Potential advantages: soil ecology","Bean",null,null,{"$f":"HLOOKUP(Table1[[#This Row],[Catch crop]], Tool!C$29:M$29,1,0)","v":{"$error":"#N/A"}}]
["Attract beneficials","Potential advantages: other","Bean",null,null,{"$f":"HLOOKUP(Table1[[#This Row],[Catch crop]], Tool!C$29:M$29,1,0)","v":{"$error":"#N/A"}}]
["Bears traffic","Potential advantages: other","Bean",null,null,{"$f":"HLOOKUP(Table1[[#This Row],[Catch crop]], Tool!C$29:M$29,1,0)","v":{"$error":"#N/A"}}]
["Short windows","Potential advantages: other","Bean",null,null,{"$f":"HLOOKUP(Table1[[#This Row],[Catch crop]], Tool!C$29:M$29,1,0)","v":{"$error":"#N/A"}}]
["Weed potential","Potential disadvantages: increase pest risks","Bean",null,null,{"$f":"HLOOKUP(Table1[[#This Row],[Catch crop]], Tool!C$29:M$29,1,0)","v":{"$error":"#N/A"}}]
["Insects/ nematodes","Potential disadvantages: increase pest risks","Bean",null,null,{"$f":"HLOOKUP(Table1[[#This Row],[Catch crop]], Tool!C$29:M$29,1,0)","v":{"$error":"#N/A"}}]
["Crop disease","Potential disadvantages: increase pest risks","Bean",null,null,{"$f":"HLOOKUP(Table1[[#This Row],[Catch crop]], Tool!C$29:M$29,1,0)","v":{"$error":"#N/A"}}]
["Hinder crops","Potential disadvantages: management challenges","Bean",null,null,{"$f":"HLOOKUP(Table1[[#This Row],[Catch crop]], Tool!C$29:M$29,1,0)","v":{"$error":"#N/A"}}]
["Establishing","Potential disadvantages: management challenges","Bean",null,null,{"$f":"HLOOKUP(Table1[[#This Row],[Catch crop]], Tool!C$29:M$29,1,0)","v":{"$error":"#N/A"}}]
["Killing by tillage","Potential disadvantages: management challenges","Bean",null,null,{"$f":"HLOOKUP(Table1[[#This Row],[Catch crop]], Tool!C$29:M$29,1,0)","v":{"$error":"#N/A"}}]
["Killing by mow","Potential disadvantages: management challenges","Bean",null,null,{"$f":"HLOOKUP(Table1[[#This Row],[Catch crop]], Tool!C$29:M$29,1,0)","v":{"$error":"#N/A"}}]
["Incorporation of mature stand","Potential disadvantages: management challenges","Bean",null,null,{"$f":"HLOOKUP(Table1[[#This Row],[Catch crop]], Tool!C$29:M$29,1,0)","v":{"$error":"#N/A"}}]

{"sheet":"Catch crop features","index":11,"n_rows":526,"n_cols":8,"rows_kept":526,"cut":false,"hidden":true,"merged":[]}
["Feature","Title","Catch crop","Value_text","Value","Filter","Achieved","Remaining"]
["Perteklinio azoto sulaikymas","Veiksmingumas ir funkcijos","Baltosios garstyčios","Excellent",4,{"$f":"HLOOKUP(Table2[[#This Row],[Catch crop]], Tool!C$29:M$29,1,0)","v":"Baltosios garstyčios"},50,{"$f":"100-Table2[[#This Row],[Achieved]]","v":50}]
["Organinės medžiagos kiekio didinimas","Veiksmingumas ir funkcijos","Baltosios garstyčios","Very good",3,{"$f":"HLOOKUP(Table2[[#This Row],[Catch crop]], Tool!C$29:M$29,1,0)","v":"Baltosios garstyčios"},75,{"$f":"100-Table2[[#This Row],[Achieved]]","v":25}]
["Erozijos mažinimas","Veiksmingumas ir funkcijos","Baltosios garstyčios","Very good",3,{"$f":"HLOOKUP(Table2[[#This Row],[Catch crop]], Tool!C$29:M$29,1,0)","v":"Baltosios garstyčios"},75,{"$f":"100-Table2[[#This Row],[Achieved]]","v":25}]
["Piktžolėtumo mažinimas","Veiksmingumas ir funkcijos","Baltosios garstyčios","Very good",3,{"$f":"HLOOKUP(Table2[[#This Row],[Catch crop]], Tool!C$29:M$29,1,0)","v":"Baltosios garstyčios"},75,{"$f":"100-Table2[[#This Row],[Achieved]]","v":25}]
["Greitas augimas","Veiksmingumas ir funkcijos","Baltosios garstyčios","Very good",3,{"$f":"HLOOKUP(Table2[[#This Row],[Catch crop]], Tool!C$29:M$29,1,0)","v":"Baltosios garstyčios"},75,{"$f":"100-Table2[[#This Row],[Achieved]]","v":25}]
["Liekanų ilgaamžiškumas","Veiksmingumas ir funkcijos","Baltosios garstyčios","Fair",1,{"$f":"HLOOKUP(Table2[[#This Row],[Catch crop]], Tool!C$29:M$29,1,0)","v":"Baltosios garstyčios"},25,{"$f":"100-Table2[[#This Row],[Achieved]]","v":75}]
["Tinkamumas augti su pagrindiniu pasėliu","Veiksmingumas ir funkcijos","Baltosios garstyčios","Poor",0,{"$f":"HLOOKUP(Table2[[#This Row],[Catch crop]], Tool!C$29:M$29,1,0)","v":"Baltosios garstyčios"},0,{"$f":"100-Table2[[#This Row],[Achieved]]","v":100}]
["Atsparumas šalčiui/ šalnoms","Atsparumas/ pakantumas","Baltosios garstyčios","Poor",0,{"$f":"HLOOKUP(Table2[[#This Row],[Catch crop]], Tool!C$29:M$29,1,0)","v":"Baltosios garstyčios"},75,{"$f":"100-Table2[[#This Row],[Achieved]]","v":25}]
["Pakantumas kaitrai","Atsparumas/ pakantumas","Baltosios garstyčios","Good",2,{"$f":"HLOOKUP(Table2[[#This Row],[Catch crop]], Tool!C$29:M$29,1,0)","v":"Baltosios garstyčios"},75,{"$f":"100-Table2[[#This Row],[Achieved]]","v":25}]
["Pakantumas sausrai","Atsparumas/ pakantumas","Baltosios garstyčios","Very good",3,{"$f":"HLOOKUP(Table2[[#This Row],[Catch crop]], Tool!C$29:M$29,1,0)","v":"Baltosios garstyčios"},75,{"$f":"100-Table2[[#This Row],[Achieved]]","v":25}]
["Paunksmės toleravimas","Atsparumas/ pakantumas","Baltosios garstyčios","Good",2,{"$f":"HLOOKUP(Table2[[#This Row],[Catch crop]], Tool!C$29:M$29,1,0)","v":"Baltosios garstyčios"},75,{"$f":"100-Table2[[#This Row],[Achieved]]","v":25}]
["Pakantumas užtvindymui","Atsparumas/ pakantumas","Baltosios garstyčios","Fair",1,{"$f":"HLOOKUP(Table2[[#This Row],[Catch crop]], Tool!C$29:M$29,1,0)","v":"Baltosios garstyčios"},50,{"$f":"100-Table2[[#This Row],[Achieved]]","v":50}]
["Pakantumas nederlingoms dirvoms","Atsparumas/ pakantumas","Baltosios garstyčios","Fair",1,{"$f":"HLOOKUP(Table2[[#This Row],[Catch crop]], Tool!C$29:M$29,1,0)","v":"Baltosios garstyčios"},25,{"$f":"100-Table2[[#This Row],[Achieved]]","v":75}]
["Podirvio purenimas","Privalumai: poveikis dirvožemiui","Baltosios garstyčios","Fair",1,{"$f":"HLOOKUP(Table2[[#This Row],[Catch crop]], Tool!C$29:M$29,1,0)","v":"Baltosios garstyčios"},0,{"$f":"100-Table2[[#This Row],[Achieved]]","v":100}]
["Judriųjų P ir K gausinimas","Privalumai: poveikis dirvožemiui","Baltosios garstyčios","Good",2,{"$f":"HLOOKUP(Table2[[#This Row],[Catch crop]], Tool!C$29:M$29,1,0)","v":"Baltosios garstyčios"},75,{"$f":"100-Table2[[#This Row],[Achieved]]","v":25}]
["Armens purenimas","Privalumai: poveikis dirvožemiui","Baltosios garstyčios","Very good",3,{"$f":"HLOOKUP(Table2[[#This Row],[Catch crop]], Tool!C$29:M$29,1,0)","v":"Baltosios garstyčios"},50,{"$f":"100-Table2[[#This Row],[Achieved]]","v":50}]
["Nematodų kontrolė","Privalumai: ligų ir piktžolių kontrolė","Baltosios garstyčios","Very good",3,{"$f":"HLOOKUP(Table2[[#This Row],[Catch crop]], Tool!C$29:M$29,1,0)","v":"Baltosios garstyčios"},75,{"$f":"100-Table2[[#This Row],[Achieved]]","v":25}]
["Ligų kontrolė","Privalumai: ligų ir piktžolių kontrolė","Baltosios garstyčios","Very good",3,{"$f":"HLOOKUP(Table2[[#This Row],[Catch crop]], Tool!C$29:M$29,1,0)","v":"Baltosios garstyčios"},75,{"$f":"100-Table2[[#This Row],[Achieved]]","v":25}]
["Alelopatinis poveikis","Privalumai: ligų ir piktžolių kontrolė","Baltosios garstyčios","Very good",3,{"$f":"HLOOKUP(Table2[[#This Row],[Catch crop]], Tool!C$29:M$29,1,0)","v":"Baltosios garstyčios"},75,{"$f":"100-Table2[[#This Row],[Achieved]]","v":25}]
["Piktžolių stelbimas","Privalumai: ligų ir piktžolių kontrolė","Baltosios garstyčios","Very good",3,{"$f":"HLOOKUP(Table2[[#This Row],[Catch crop]], Tool!C$29:M$29,1,0)","v":"Baltosios garstyčios"},50,{"$f":"100-Table2[[#This Row],[Achieved]]","v":50}]
["Naudingų vabzdžių pritraukimas","Privalumai: poveikis dirvožemiui","Baltosios garstyčios","Good",2,{"$f":"HLOOKUP(Table2[[#This Row],[Catch crop]], Tool!C$29:M$29,1,0)","v":"Baltosios garstyčios"},0,{"$f":"100-Table2[[#This Row],[Achieved]]","v":100}]
["Tinkamumas trumpam laikotarpiui","Privalumai: poveikis dirvožemiui","Baltosios garstyčios","Very good",3,{"$f":"HLOOKUP(Table2[[#This Row],[Catch crop]], Tool!C$29:M$29,1,0)","v":"Baltosios garstyčios"},75,{"$f":"100-Table2[[#This Row],[Achieved]]","v":25}]
["Perteklinio azoto sulaikymas","Veiksmingumas ir funkcijos","Rudosios garstyčios","Excellent",4,{"$f":"HLOOKUP(Table2[[#This Row],[Catch crop]], Tool!C$29:M$29,1,0)","v":{"$error":"#N/A"}},50,{"$f":"100-Table2[[#This Row],[Achieved]]","v":50}]
["Organinės medžiagos kiekio didinimas","Veiksmingumas ir funkcijos","Rudosios garstyčios","Very good",3,{"$f":"HLOOKUP(Table2[[#This Row],[Catch crop]], Tool!C$29:M$29,1,0)","v":{"$error":"#N/A"}},75,{"$f":"100-Table2[[#This Row],[Achieved]]","v":25}]
["Erozijos mažinimas","Veiksmingumas ir funkcijos","Rudosios garstyčios","Very good",3,{"$f":"HLOOKUP(Table2[[#This Row],[Catch crop]], Tool!C$29:M$29,1,0)","v":{"$error":"#N/A"}},75,{"$f":"100-Table2[[#This Row],[Achieved]]","v":25}]
["Piktžolėtumo mažinimas","Veiksmingumas ir funkcijos","Rudosios garstyčios","Very good",3,{"$f":"HLOOKUP(Table2[[#This Row],[Catch crop]], Tool!C$29:M$29,1,0)","v":{"$error":"#N/A"}},75,{"$f":"100-Table2[[#This Row],[Achieved]]","v":25}]
["Greitas augimas","Veiksmingumas ir funkcijos","Rudosios garstyčios","Good",2,{"$f":"HLOOKUP(Table2[[#This Row],[Catch crop]], Tool!C$29:M$29,1,0)","v":{"$error":"#N/A"}},50,{"$f":"100-Table2[[#This Row],[Achieved]]","v":50}]
["Liekanų ilgaamžiškumas","Veiksmingumas ir funkcijos","Rudosios garstyčios","Fair",1,{"$f":"HLOOKUP(Table2[[#This Row],[Catch crop]], Tool!C$29:M$29,1,0)","v":{"$error":"#N/A"}},0,{"$f":"100-Table2[[#This Row],[Achieved]]","v":100}]
["Tinkamumas augti su pagrindiniu pasėliu","Veiksmingumas ir funkcijos","Rudosios garstyčios","Poor",0,{"$f":"HLOOKUP(Table2[[#This Row],[Catch crop]], Tool!C$29:M$29,1,0)","v":{"$error":"#N/A"}},100,{"$f":"100-Table2[[#This Row],[Achieved]]","v":0}]
["Atsparumas šalčiui/ šalnoms","Atsparumas/ pakantumas","Rudosios garstyčios","Poor",0,{"$f":"HLOOKUP(Table2[[#This Row],[Catch crop]], Tool!C$29:M$29,1,0)","v":{"$error":"#N/A"}},75,{"$f":"100-Table2[[#This Row],[Achieved]]","v":25}]
["Pakantumas kaitrai","Atsparumas/ pakantumas","Rudosios garstyčios","Very good",3,{"$f":"HLOOKUP(Table2[[#This Row],[Catch crop]], Tool!C$29:M$29,1,0)","v":{"$error":"#N/A"}},75,{"$f":"100-Table2[[#This Row],[Achieved]]","v":25}]
["Pakantumas sausrai","Atsparumas/ pakantumas","Rudosios garstyčios","Excellent",4,{"$f":"HLOOKUP(Table2[[#This Row],[Catch crop]], Tool!C$29:M$29,1,0)","v":{"$error":"#N/A"}},100,{"$f":"100-Table2[[#This Row],[Achieved]]","v":0}]
["Paunksmės toleravimas","Atsparumas/ pakantumas","Rudosios garstyčios","Good",2,{"$f":"HLOOKUP(Table2[[#This Row],[Catch crop]], Tool!C$29:M$29,1,0)","v":{"$error":"#N/A"}},75,{"$f":"100-Table2[[#This Row],[Achieved]]","v":25}]
["Pakantumas užtvindymui","Atsparumas/ pakantumas","Rudosios garstyčios","Fair",1,{"$f":"HLOOKUP(Table2[[#This Row],[Catch crop]], Tool!C$29:M$29,1,0)","v":{"$error":"#N/A"}},25,{"$f":"100-Table2[[#This Row],[Achieved]]","v":75}]
["Pakantumas nederlingoms dirvoms","Atsparumas/ pakantumas","Rudosios garstyčios","Fair",1,{"$f":"HLOOKUP(Table2[[#This Row],[Catch crop]], Tool!C$29:M$29,1,0)","v":{"$error":"#N/A"}},25,{"$f":"100-Table2[[#This Row],[Achieved]]","v":75}]
["Podirvio purenimas","Privalumai: poveikis dirvožemiui","Rudosios garstyčios","Very good",3,{"$f":"HLOOKUP(Table2[[#This Row],[Catch crop]], Tool!C$29:M$29,1,0)","v":{"$error":"#N/A"}},100,{"$f":"100-Table2[[#This Row],[Achieved]]","v":0}]
["Judriųjų P ir K gausinimas","Privalumai: poveikis dirvožemiui","Rudosios garstyčios","Good",2,{"$f":"HLOOKUP(Table2[[#This Row],[Catch crop]], Tool!C$29:M$29,1,0)","v":{"$error":"#N/A"}},100,{"$f":"100-Table2[[#This Row],[Achieved]]","v":0}]
["Armens purenimas","Privalumai: poveikis dirvožemiui","Rudosios garstyčios","Very good",3,{"$f":"HLOOKUP(Table2[[#This Row],[Catch crop]], Tool!C$29:M$29,1,0)","v":{"$error":"#N/A"}},75,{"$f":"100-Table2[[#This Row],[Achieved]]","v":25}]
["Nematodų kontrolė","Privalumai: ligų ir piktžolių kontrolė","Rudosios garstyčios","Very good",3,{"$f":"HLOOKUP(Table2[[#This Row],[Catch crop]], Tool!C$29:M$29,1,0)","v":{"$error":"#N/A"}},75,{"$f":"100-Table2[[#This Row],[Achieved]]","v":25}]
["Ligų kontrolė","Privalumai: ligų ir piktžolių kontrolė","Rudosios garstyčios","Excellent",4,{"$f":"HLOOKUP(Table2[[#This Row],[Catch crop]], Tool!C$29:M$29,1,0)","v":{"$error":"#N/A"}},75,{"$f":"100-Table2[[#This Row],[Achieved]]","v":25}]
["Alelopatinis poveikis","Privalumai: ligų ir piktžolių kontrolė","Rudosios garstyčios","Very good",3,{"$f":"HLOOKUP(Table2[[#This Row],[Catch crop]], Tool!C$29:M$29,1,0)","v":{"$error":"#N/A"}},75,{"$f":"100-Table2[[#This Row],[Achieved]]","v":25}]
["Piktžolių stelbimas","Privalumai: ligų ir piktžolių kontrolė","Rudosios garstyčios","Very good",3,{"$f":"HLOOKUP(Table2[[#This Row],[Catch crop]], Tool!C$29:M$29,1,0)","v":{"$error":"#N/A"}},100,{"$f":"100-Table2[[#This Row],[Achieved]]","v":0}]
["Naudingų vabzdžių pritraukimas","Privalumai: poveikis dirvožemiui","Rudosios garstyčios","Good",2,{"$f":"HLOOKUP(Table2[[#This Row],[Catch crop]], Tool!C$29:M$29,1,0)","v":{"$error":"#N/A"}},100,{"$f":"100-Table2[[#This Row],[Achieved]]","v":0}]
["Tinkamumas trumpam laikotarpiui","Privalumai: poveikis dirvožemiui","Rudosios garstyčios","Very good",3,{"$f":"HLOOKUP(Table2[[#This Row],[Catch crop]], Tool!C$29:M$29,1,0)","v":{"$error":"#N/A"}},75,{"$f":"100-Table2[[#This Row],[Achieved]]","v":25}]
["Perteklinio azoto sulaikymas","Veiksmingumas ir funkcijos","Vasariniai rapsai","Very good",3,{"$f":"HLOOKUP(Table2[[#This Row],[Catch crop]], Tool!C$29:M$29,1,0)","v":"Vasariniai rapsai"},100,{"$f":"100-Table2[[#This Row],[Achieved]]","v":0}]
["Organinės medžiagos kiekio didinimas","Veiksmingumas ir funkcijos","Vasariniai rapsai","Good",2,{"$f":"HLOOKUP(Table2[[#This Row],[Catch crop]], Tool!C$29:M$29,1,0)","v":"Vasariniai rapsai"},75,{"$f":"100-Table2[[#This Row],[Achieved]]","v":25}]
["Erozijos mažinimas","Veiksmingumas ir funkcijos","Vasariniai rapsai","Very good",3,{"$f":"HLOOKUP(Table2[[#This Row],[Catch crop]], Tool!C$29:M$29,1,0)","v":"Vasariniai rapsai"},100,{"$f":"100-Table2[[#This Row],[Achieved]]","v":0}]
["Piktžolėtumo mažinimas","Veiksmingumas ir funkcijos","Vasariniai rapsai","Very good",3,{"$f":"HLOOKUP(Table2[[#This Row],[Catch crop]], Tool!C$29:M$29,1,0)","v":"Vasariniai rapsai"},100,{"$f":"100-Table2[[#This Row],[Achieved]]","v":0}]
["Greitas augimas","Veiksmingumas ir funkcijos","Vasariniai rapsai","Very good",3,{"$f":"HLOOKUP(Table2[[#This Row],[Catch crop]], Tool!C$29:M$29,1,0)","v":"Vasariniai rapsai"},25,{"$f":"100-Table2[[#This Row],[Achieved]]","v":75}]
["Liekanų ilgaamžiškumas","Veiksmingumas ir funkcijos","Vasariniai rapsai","Good",2,{"$f":"HLOOKUP(Table2[[#This Row],[Catch crop]], Tool!C$29:M$29,1,0)","v":"Vasariniai rapsai"},100,{"$f":"100-Table2[[#This Row],[Achieved]]","v":0}]
["Tinkamumas augti su pagrindiniu pasėliu","Veiksmingumas ir funkcijos","Vasariniai rapsai","Poor",0,{"$f":"HLOOKUP(Table2[[#This Row],[Catch crop]], Tool!C$29:M$29,1,0)","v":"Vasariniai rapsai"},100,{"$f":"100-Table2[[#This Row],[Achieved]]","v":0}]
["Atsparumas šalčiui/ šalnoms","Atsparumas/ pakantumas","Vasariniai rapsai","Fair",1,{"$f":"HLOOKUP(Table2[[#This Row],[Catch crop]], Tool!C$29:M$29,1,0)","v":"Vasariniai rapsai"},100,{"$f":"100-Table2[[#This Row],[Achieved]]","v":0}]
["Pakantumas kaitrai","Atsparumas/ pakantumas","Vasariniai rapsai","Fair",1,{"$f":"HLOOKUP(Table2[[#This Row],[Catch crop]], Tool!C$29:M$29,1,0)","v":"Vasariniai rapsai"},100,{"$f":"100-Table2[[#This Row],[Achieved]]","v":0}]
["Pakantumas sausrai","Atsparumas/ pakantumas","Vasariniai rapsai","Good",2,{"$f":"HLOOKUP(Table2[[#This Row],[Catch crop]], Tool!C$29:M$29,1,0)","v":"Vasariniai rapsai"},100,{"$f":"100-Table2[[#This Row],[Achieved]]","v":0}]
["Paunksmės toleravimas","Atsparumas/ pakantumas","Vasariniai rapsai","Good",2,{"$f":"HLOOKUP(Table2[[#This Row],[Catch crop]], Tool!C$29:M$29,1,0)","v":"Vasariniai rapsai"},100,{"$f":"100-Table2[[#This Row],[Achieved]]","v":0}]
["Pakantumas užtvindymui","Atsparumas/ pakantumas","Vasariniai rapsai","Fair",1,{"$f":"HLOOKUP(Table2[[#This Row],[Catch crop]], Tool!C$29:M$29,1,0)","v":"Vasariniai rapsai"},75,{"$f":"100-Table2[[#This Row],[Achieved]]","v":25}]
["Pakantumas nederlingoms dirvoms","Atsparumas/ pakantumas","Vasariniai rapsai","Very good",3,{"$f":"HLOOKUP(Table2[[#This Row],[Catch crop]], Tool!C$29:M$29,1,0)","v":"Vasariniai rapsai"},25,{"$f":"100-Table2[[#This Row],[Achieved]]","v":75}]
["Podirvio purenimas","Privalumai: poveikis dirvožemiui","Vasariniai rapsai","Good",2,{"$f":"HLOOKUP(Table2[[#This Row],[Catch crop]], Tool!C$29:M$29,1,0)","v":"Vasariniai rapsai"},50,{"$f":"100-Table2[[#This Row],[Achieved]]","v":50}]
["Judriųjų P ir K gausinimas","Privalumai: poveikis dirvožemiui","Vasariniai rapsai","Fair",1,{"$f":"HLOOKUP(Table2[[#This Row],[Catch crop]], Tool!C$29:M$29,1,0)","v":"Vasariniai rapsai"},75,{"$f":"100-Table2[[#This Row],[Achieved]]","v":25}]
["Armens purenimas","Privalumai: poveikis dirvožemiui","Vasariniai rapsai","Good",2,{"$f":"HLOOKUP(Table2[[#This Row],[Catch crop]], Tool!C$29:M$29,1,0)","v":"Vasariniai rapsai"},75,{"$f":"100-Table2[[#This Row],[Achieved]]","v":25}]
["Nematodų kontrolė","Privalumai: ligų ir piktžolių kontrolė","Vasariniai rapsai","Very good",3,{"$f":"HLOOKUP(Table2[[#This Row],[Catch crop]], Tool!C$29:M$29,1,0)","v":"Vasariniai rapsai"},25,{"$f":"100-Table2[[#This Row],[Achieved]]","v":75}]
["Ligų kontrolė","Privalumai: ligų ir piktžolių kontrolė","Vasariniai rapsai","Good",2,{"$f":"HLOOKUP(Table2[[#This Row],[Catch crop]], Tool!C$29:M$29,1,0)","v":"Vasariniai rapsai"},25,{"$f":"100-Table2[[#This Row],[Achieved]]","v":75}]
["Alelopatinis poveikis","Privalumai: ligų ir piktžolių kontrolė","Vasariniai rapsai","Very good",3,{"$f":"HLOOKUP(Table2[[#This Row],[Catch crop]], Tool!C$29:M$29,1,0)","v":"Vasariniai rapsai"},75,{"$f":"100-Table2[[#This Row],[Achieved]]","v":25}]
["Piktžolių stelbimas","Privalumai: ligų ir piktžolių kontrolė","Vasariniai rapsai","Very good",3,{"$f":"HLOOKUP(Table2[[#This Row],[Catch crop]], Tool!C$29:M$29,1,0)","v":"Vasariniai rapsai"},50,{"$f":"100-Table2[[#This Row],[Achieved]]","v":50}]
["Naudingų vabzdžių pritraukimas","Privalumai: poveikis dirvožemiui","Vasariniai rapsai","Good",2,{"$f":"HLOOKUP(Table2[[#This Row],[Catch crop]], Tool!C$29:M$29,1,0)","v":"Vasariniai rapsai"},75,{"$f":"100-Table2[[#This Row],[Achieved]]","v":25}]
["Tinkamumas trumpam laikotarpiui","Privalumai: poveikis dirvožemiui","Vasariniai rapsai","Good",2,{"$f":"HLOOKUP(Table2[[#This Row],[Catch crop]], Tool!C$29:M$29,1,0)","v":"Vasariniai rapsai"},50,{"$f":"100-Table2[[#This Row],[Achieved]]","v":50}]
["Perteklinio azoto sulaikymas","Veiksmingumas ir funkcijos","Žieminiai rapsai","Excellent",4,{"$f":"HLOOKUP(Table2[[#This Row],[Catch crop]], Tool!C$29:M$29,1,0)","v":"Žieminiai rapsai"},75,{"$f":"100-Table2[[#This Row],[Achieved]]","v":25}]
["Organinės medžiagos kiekio didinimas","Veiksmingumas ir funkcijos","Žieminiai rapsai","Good",2,{"$f":"HLOOKUP(Table2[[#This Row],[Catch crop]], Tool!C$29:M$29,1,0)","v":"Žieminiai rapsai"},25,{"$f":"100-Table2[[#This Row],[Achieved]]","v":75}]
["Erozijos mažinimas","Veiksmingumas ir funkcijos","Žieminiai rapsai","Very good",3,{"$f":"HLOOKUP(Table2[[#This Row],[Catch crop]], Tool!C$29:M$29,1,0)","v":"Žieminiai rapsai"},25,{"$f":"100-Table2[[#This Row],[Achieved]]","v":75}]
["Piktžolėtumo mažinimas","Veiksmingumas ir funkcijos","Žieminiai rapsai","Very good",3,{"$f":"HLOOKUP(Table2[[#This Row],[Catch crop]], Tool!C$29:M$29,1,0)","v":"Žieminiai rapsai"},100,{"$f":"100-Table2[[#This Row],[Achieved]]","v":0}]
["Greitas augimas","Veiksmingumas ir funkcijos","Žieminiai rapsai","Very good",3,{"$f":"HLOOKUP(Table2[[#This Row],[Catch crop]], Tool!C$29:M$29,1,0)","v":"Žieminiai rapsai"},25,{"$f":"100-Table2[[#This Row],[Achieved]]","v":75}]
["Liekanų ilgaamžiškumas","Veiksmingumas ir funkcijos","Žieminiai rapsai","Good",2,{"$f":"HLOOKUP(Table2[[#This Row],[Catch crop]], Tool!C$29:M$29,1,0)","v":"Žieminiai rapsai"},100,{"$f":"100-Table2[[#This Row],[Achieved]]","v":0}]
["Tinkamumas augti su pagrindiniu pasėliu","Veiksmingumas ir funkcijos","Žieminiai rapsai","Poor",0,{"$f":"HLOOKUP(Table2[[#This Row],[Catch crop]], Tool!C$29:M$29,1,0)","v":"Žieminiai rapsai"},75,{"$f":"100-Table2[[#This Row],[Achieved]]","v":25}]
["Atsparumas šalčiui/ šalnoms","Atsparumas/ pakantumas","Žieminiai rapsai","Excellent",4,{"$f":"HLOOKUP(Table2[[#This Row],[Catch crop]], Tool!C$29:M$29,1,0)","v":"Žieminiai rapsai"},75,{"$f":"100-Table2[[#This Row],[Achieved]]","v":25}]
["Pakantumas kaitrai","Atsparumas/ pakantumas","Žieminiai rapsai","Fair",1,{"$f":"HLOOKUP(Table2[[#This Row],[Catch crop]], Tool!C$29:M$29,1,0)","v":"Žieminiai rapsai"},50,{"$f":"100-Table2[[#This Row],[Achieved]]","v":50}]
["Pakantumas sausrai","Atsparumas/ pakantumas","Žieminiai rapsai","Good",2,{"$f":"HLOOKUP(Table2[[#This Row],[Catch crop]], Tool!C$29:M$29,1,0)","v":"Žieminiai rapsai"},75,{"$f":"100-Table2[[#This Row],[Achieved]]","v":25}]
["Paunksmės toleravimas","Atsparumas/ pakantumas","Žieminiai rapsai","Good",2,{"$f":"HLOOKUP(Table2[[#This Row],[Catch crop]], Tool!C$29:M$29,1,0)","v":"Žieminiai rapsai"},50,{"$f":"100-Table2[[#This Row],[Achieved]]","v":50}]
["Pakantumas užtvindymui","Atsparumas/ pakantumas","Žieminiai rapsai","Fair",1,{"$f":"HLOOKUP(Table2[[#This Row],[Catch crop]], Tool!C$29:M$29,1,0)","v":"Žieminiai rapsai"},75,{"$f":"100-Table2[[#This Row],[Achieved]]","v":25}]
["Pakantumas nederlingoms dirvoms","Atsparumas/ pakantumas","Žieminiai rapsai","Fair",1,{"$f":"HLOOKUP(Table2[[#This Row],[Catch crop]], Tool!C$29:M$29,1,0)","v":"Žieminiai rapsai"},75,{"$f":"100-Table2[[#This Row],[Achieved]]","v":25}]
["Podirvio purenimas","Privalumai: poveikis dirvožemiui","Žieminiai rapsai","Very good",3,{"$f":"HLOOKUP(Table2[[#This Row],[Catch crop]], Tool!C$29:M$29,1,0)","v":"Žieminiai rapsai"},75,{"$f":"100-Table2[[#This Row],[Achieved]]","v":25}]
["Judriųjų P ir K gausinimas","Privalumai: poveikis dirvožemiui","Žieminiai rapsai","Fair",1,{"$f":"HLOOKUP(Table2[[#This Row],[Catch crop]], Tool!C$29:M$29,1,0)","v":"Žieminiai rapsai"},75,{"$f":"100-Table2[[#This Row],[Achieved]]","v":25}]
["Armens purenimas","Privalumai: poveikis dirvožemiui","Žieminiai rapsai","Good",2,{"$f":"HLOOKUP(Table2[[#This Row],[Catch crop]], Tool!C$29:M$29,1,0)","v":"Žieminiai rapsai"},75,{"$f":"100-Table2[[#This Row],[Achieved]]","v":25}]
["Nematodų kontrolė","Privalumai: ligų ir piktžolių kontrolė","Žieminiai rapsai","Very good",3,{"$f":"HLOOKUP(Table2[[#This Row],[Catch crop]], Tool!C$29:M$29,1,0)","v":"Žieminiai rapsai"},75,{"$f":"100-Table2[[#This Row],[Achieved]]","v":25}]
["Ligų kontrolė","Privalumai: ligų ir piktžolių kontrolė","Žieminiai rapsai","Good",2,{"$f":"HLOOKUP(Table2[[#This Row],[Catch crop]], Tool!C$29:M$29,1,0)","v":"Žieminiai rapsai"},100,{"$f":"100-Table2[[#This Row],[Achieved]]","v":0}]
["Alelopatinis poveikis","Privalumai: ligų ir piktžolių kontrolė","Žieminiai rapsai","Very good",3,{"$f":"HLOOKUP(Table2[[#This Row],[Catch crop]], Tool!C$29:M$29,1,0)","v":"Žieminiai rapsai"},null,{"$f":"100-Table2[[#This Row],[Achieved]]","v":100}]
["Piktžolių stelbimas","Privalumai: ligų ir piktžolių kontrolė","Žieminiai rapsai","Good",2,{"$f":"HLOOKUP(Table2[[#This Row],[Catch crop]], Tool!C$29:M$29,1,0)","v":"Žieminiai rapsai"},null,{"$f":"100-Table2[[#This Row],[Achieved]]","v":100}]
["Naudingų vabzdžių pritraukimas","Privalumai: poveikis dirvožemiui","Žieminiai rapsai","Good",2,{"$f":"HLOOKUP(Table2[[#This Row],[Catch crop]], Tool!C$29:M$29,1,0)","v":"Žieminiai rapsai"},null,{"$f":"100-Table2[[#This Row],[Achieved]]","v":100}]
["Tinkamumas trumpam laikotarpiui","Privalumai: poveikis dirvožemiui","Žieminiai rapsai","Good",2,{"$f":"HLOOKUP(Table2[[#This Row],[Catch crop]], Tool!C$29:M$29,1,0)","v":"Žieminiai rapsai"},null,{"$f":"100-Table2[[#This Row],[Achieved]]","v":100}]
["Perteklinio azoto sulaikymas","Veiksmingumas ir funkcijos","Aliejiniai ridikai","Excellent",4,{"$f":"HLOOKUP(Table2[[#This Row],[Catch crop]], Tool!C$29:M$29,1,0)","v":"Aliejiniai ridikai"},null,{"$f":"100-Table2[[#This Row],[Achieved]]","v":100}]
["Organinės medžiagos kiekio didinimas","Veiksmingumas ir funkcijos","Aliejiniai ridikai","Very good",3,{"$f":"HLOOKUP(Table2[[#This Row],[Catch crop]], Tool!C$29:M$29,1,0)","v":"Aliejiniai ridikai"},null,{"$f":"100-Table2[[#This Row],[Achieved]]","v":100}]
["Erozijos mažinimas","Veiksmingumas ir funkcijos","Aliejiniai ridikai","Very good",3,{"$f":"HLOOKUP(Table2[[#This Row],[Catch crop]], Tool!C$29:M$29,1,0)","v":"Aliejiniai ridikai"},null,{"$f":"100-Table2[[#This Row],[Achieved]]","v":100}]
["Piktžolėtumo mažinimas","Veiksmingumas ir funkcijos","Aliejiniai ridikai","Excellent",4,{"$f":"HLOOKUP(Table2[[#This Row],[Catch crop]], Tool!C$29:M$29,1,0)","v":"Aliejiniai ridikai"},25,{"$f":"100-Table2[[#This Row],[Achieved]]","v":75}]
["Greitas augimas","Veiksmingumas ir funkcijos","Aliejiniai ridikai","Very good",3,{"$f":"HLOOKUP(Table2[[#This Row],[Catch crop]], Tool!C$29:M$29,1,0)","v":"Aliejiniai ridikai"},75,{"$f":"100-Table2[[#This Row],[Achieved]]","v":25}]
["Liekanų ilgaamžiškumas","Veiksmingumas ir funkcijos","Aliejiniai ridikai","Fair",1,{"$f":"HLOOKUP(Table2[[#This Row],[Catch crop]], Tool!C$29:M$29,1,0)","v":"Aliejiniai ridikai"},75,{"$f":"100-Table2[[#This Row],[Achieved]]","v":25}]
["Tinkamumas augti su pagrindiniu pasėliu","Veiksmingumas ir funkcijos","Aliejiniai ridikai","Fair",1,{"$f":"HLOOKUP(Table2[[#This Row],[Catch crop]], Tool!C$29:M$29,1,0)","v":"Aliejiniai ridikai"},75,{"$f":"100-Table2[[#This Row],[Achieved]]","v":25}]
["Atsparumas šalčiui/ šalnoms","Atsparumas/ pakantumas","Aliejiniai ridikai","Good",2,{"$f":"HLOOKUP(Table2[[#This Row],[Catch crop]], Tool!C$29:M$29,1,0)","v":"Aliejiniai ridikai"},75,{"$f":"100-Table2[[#This Row],[Achieved]]","v":25}]
["Pakantumas kaitrai","Atsparumas/ pakantumas","Aliejiniai ridikai","Good",2,{"$f":"HLOOKUP(Table2[[#This Row],[Catch crop]], Tool!C$29:M$29,1,0)","v":"Aliejiniai ridikai"},50,{"$f":"100-Table2[[#This Row],[Achieved]]","v":50}]
["Pakantumas sausrai","Atsparumas/ pakantumas","Aliejiniai ridikai","Fair",1,{"$f":"HLOOKUP(Table2[[#This Row],[Catch crop]], Tool!C$29:M$29,1,0)","v":"Aliejiniai ridikai"},100,{"$f":"100-Table2[[#This Row],[Achieved]]","v":0}]
["Paunksmės toleravimas","Atsparumas/ pakantumas","Aliejiniai ridikai","Good",2,{"$f":"HLOOKUP(Table2[[#This Row],[Catch crop]], Tool!C$29:M$29,1,0)","v":"Aliejiniai ridikai"},null,{"$f":"100-Table2[[#This Row],[Achieved]]","v":100}]
["Pakantumas užtvindymui","Atsparumas/ pakantumas","Aliejiniai ridikai","Fair",1,{"$f":"HLOOKUP(Table2[[#This Row],[Catch crop]], Tool!C$29:M$29,1,0)","v":"Aliejiniai ridikai"},null,{"$f":"100-Table2[[#This Row],[Achieved]]","v":100}]
["Pakantumas nederlingoms dirvoms","Atsparumas/ pakantumas","Aliejiniai ridikai","Fair",1,{"$f":"HLOOKUP(Table2[[#This Row],[Catch crop]], Tool!C$29:M$29,1,0)","v":"Aliejiniai ridikai"},null,{"$f":"100-Table2[[#This Row],[Achieved]]","v":100}]
["Podirvio purenimas","Privalumai: poveikis dirvožemiui","Aliejiniai ridikai","Excellent",4,{"$f":"HLOOKUP(Table2[[#This Row],[Catch crop]], Tool!C$29:M$29,1,0)","v":"Aliejiniai ridikai"},null,{"$f":"100-Table2[[#This Row],[Achieved]]","v":100}]
["Judriųjų P ir K gausinimas","Privalumai: poveikis dirvožemiui","Aliejiniai ridikai","Very good",3,{"$f":"HLOOKUP(Table2[[#This Row],[Catch crop]], Tool!C$29:M$29,1,0)","v":"Aliejiniai ridikai"},null,{"$f":"100-Table2[[#This Row],[Achieved]]","v":100}]
["Armens purenimas","Privalumai: poveikis dirvožemiui","Aliejiniai ridikai","Good",2,{"$f":"HLOOKUP(Table2[[#This Row],[Catch crop]], Tool!C$29:M$29,1,0)","v":"Aliejiniai ridikai"},null,{"$f":"100-Table2[[#This Row],[Achieved]]","v":100}]
["Nematodų kontrolė","Privalumai: ligų ir piktžolių kontrolė","Aliejiniai ridikai","Very good",3,{"$f":"HLOOKUP(Table2[[#This Row],[Catch crop]], Tool!C$29:M$29,1,0)","v":"Aliejiniai ridikai"},null,{"$f":"100-Table2[[#This Row],[Achieved]]","v":100}]
["Ligų kontrolė","Privalumai: ligų ir piktžolių kontrolė","Aliejiniai ridikai","Good",2,{"$f":"HLOOKUP(Table2[[#This Row],[Catch crop]], Tool!C$29:M$29,1,0)","v":"Aliejiniai ridikai"},75,{"$f":"100-Table2[[#This Row],[Achieved]]","v":25}]
["Alelopatinis poveikis","Privalumai: ligų ir piktžolių kontrolė","Aliejiniai ridikai","Very good",3,{"$f":"HLOOKUP(Table2[[#This Row],[Catch crop]], Tool!C$29:M$29,1,0)","v":"Aliejiniai ridikai"},50,{"$f":"100-Table2[[#This Row],[Achieved]]","v":50}]
["Piktžolių stelbimas","Privalumai: ligų ir piktžolių kontrolė","Aliejiniai ridikai","Excellent",4,{"$f":"HLOOKUP(Table2[[#This Row],[Catch crop]], Tool!C$29:M$29,1,0)","v":"Aliejiniai ridikai"},75,{"$f":"100-Table2[[#This Row],[Achieved]]","v":25}]
["Naudingų vabzdžių pritraukimas","Privalumai: poveikis dirvožemiui","Aliejiniai ridikai","Fair",1,{"$f":"HLOOKUP(Table2[[#This Row],[Catch crop]], Tool!C$29:M$29,1,0)","v":"Aliejiniai ridikai"},100,{"$f":"100-Table2[[#This Row],[Achieved]]","v":0}]
["Tinkamumas trumpam laikotarpiui","Privalumai: poveikis dirvožemiui","Aliejiniai ridikai","Very good",3,{"$f":"HLOOKUP(Table2[[#This Row],[Catch crop]], Tool!C$29:M$29,1,0)","v":"Aliejiniai ridikai"},100,{"$f":"100-Table2[[#This Row],[Achieved]]","v":0}]
["Perteklinio azoto sulaikymas","Veiksmingumas ir funkcijos","Šakniniai ridikai","Excellent",4,{"$f":"HLOOKUP(Table2[[#This Row],[Catch crop]], Tool!C$29:M$29,1,0)","v":{"$error":"#N/A"}},50,{"$f":"100-Table2[[#This Row],[Achieved]]","v":50}]
["Organinės medžiagos kiekio didinimas","Veiksmingumas ir funkcijos","Šakniniai ridikai","Very good",3,{"$f":"HLOOKUP(Table2[[#This Row],[Catch crop]], Tool!C$29:M$29,1,0)","v":{"$error":"#N/A"}},100,{"$f":"100-Table2[[#This Row],[Achieved]]","v":0}]
["Erozijos mažinimas","Veiksmingumas ir funkcijos","Šakniniai ridikai","Very good",3,{"$f":"HLOOKUP(Table2[[#This Row],[Catch crop]], Tool!C$29:M$29,1,0)","v":{"$error":"#N/A"}},0,{"$f":"100-Table2[[#This Row],[Achieved]]","v":100}]
["Piktžolėtumo mažinimas","Veiksmingumas ir funkcijos","Šakniniai ridikai","Very good",3,{"$f":"HLOOKUP(Table2[[#This Row],[Catch crop]], Tool!C$29:M$29,1,0)","v":{"$error":"#N/A"}},50,{"$f":"100-Table2[[#This Row],[Achieved]]","v":50}]
["Greitas augimas","Veiksmingumas ir funkcijos","Šakniniai ridikai","Very good",3,{"$f":"HLOOKUP(Table2[[#This Row],[Catch crop]], Tool!C$29:M$29,1,0)","v":{"$error":"#N/A"}},25,{"$f":"100-Table2[[#This Row],[Achieved]]","v":75}]
["Liekanų ilgaamžiškumas","Veiksmingumas ir funkcijos","Šakniniai ridikai","Very good",3,{"$f":"HLOOKUP(Table2[[#This Row],[Catch crop]], Tool!C$29:M$29,1,0)","v":{"$error":"#N/A"}},100,{"$f":"100-Table2[[#This Row],[Achieved]]","v":0}]
["Tinkamumas augti su pagrindiniu pasėliu","Veiksmingumas ir funkcijos","Šakniniai ridikai","Excellent",4,{"$f":"HLOOKUP(Table2[[#This Row],[Catch crop]], Tool!C$29:M$29,1,0)","v":{"$error":"#N/A"}},100,{"$f":"100-Table2[[#This Row],[Achieved]]","v":0}]
["Atsparumas šalčiui/ šalnoms","Atsparumas/ pakantumas","Šakniniai ridikai","Fair",1,{"$f":"HLOOKUP(Table2[[#This Row],[Catch crop]], Tool!C$29:M$29,1,0)","v":{"$error":"#N/A"}},0,{"$f":"100-Table2[[#This Row],[Achieved]]","v":100}]
["Pakantumas kaitrai","Atsparumas/ pakantumas","Šakniniai ridikai","Good",2,{"$f":"HLOOKUP(Table2[[#This Row],[Catch crop]], Tool!C$29:M$29,1,0)","v":{"$error":"#N/A"}},100,{"$f":"100-Table2[[#This Row],[Achieved]]","v":0}]
["Pakantumas sausrai","Atsparumas/ pakantumas","Šakniniai ridikai","Good",2,{"$f":"HLOOKUP(Table2[[#This Row],[Catch crop]], Tool!C$29:M$29,1,0)","v":{"$error":"#N/A"}},25,{"$f":"100-Table2[[#This Row],[Achieved]]","v":75}]
["Paunksmės toleravimas","Atsparumas/ pakantumas","Šakniniai ridikai","Good",2,{"$f":"HLOOKUP(Table2[[#This Row],[Catch crop]], Tool!C$29:M$29,1,0)","v":{"$error":"#N/A"}},75,{"$f":"100-Table2[[#This Row],[Achieved]]","v":25}]
["Pakantumas užtvindymui","Atsparumas/ pakantumas","Šakniniai ridikai","Fair",1,{"$f":"HLOOKUP(Table2[[#This Row],[Catch crop]], Tool!C$29:M$29,1,0)","v":{"$error":"#N/A"}},50,{"$f":"100-Table2[[#This Row],[Achieved]]","v":50}]
["Pakantumas nederlingoms dirvoms","Atsparumas/ pakantumas","Šakniniai ridikai","Fair",1,{"$f":"HLOOKUP(Table2[[#This Row],[Catch crop]], Tool!C$29:M$29,1,0)","v":{"$error":"#N/A"}},50,{"$f":"100-Table2[[#This Row],[Achieved]]","v":50}]
["Podirvio purenimas","Privalumai: poveikis dirvožemiui","Šakniniai ridikai","Excellent",4,{"$f":"HLOOKUP(Table2[[#This Row],[Catch crop]], Tool!C$29:M$29,1,0)","v":{"$error":"#N/A"}},25,{"$f":"100-Table2[[#This Row],[Achieved]]","v":75}]
["Judriųjų P ir K gausinimas","Privalumai: poveikis dirvožemiui","Šakniniai ridikai","Very good",3,{"$f":"HLOOKUP(Table2[[#This Row],[Catch crop]], Tool!C$29:M$29,1,0)","v":{"$error":"#N/A"}},25,{"$f":"100-Table2[[#This Row],[Achieved]]","v":75}]
["Armens purenimas","Privalumai: poveikis dirvožemiui","Šakniniai ridikai","Excellent",4,{"$f":"HLOOKUP(Table2[[#This Row],[Catch crop]], Tool!C$29:M$29,1,0)","v":{"$error":"#N/A"}},50,{"$f":"100-Table2[[#This Row],[Achieved]]","v":50}]
["Nematodų kontrolė","Privalumai: ligų ir piktžolių kontrolė","Šakniniai ridikai","Very good",3,{"$f":"HLOOKUP(Table2[[#This Row],[Catch crop]], Tool!C$29:M$29,1,0)","v":{"$error":"#N/A"}},25,{"$f":"100-Table2[[#This Row],[Achieved]]","v":75}]
["Ligų kontrolė","Privalumai: ligų ir piktžolių kontrolė","Šakniniai ridikai","Good",2,{"$f":"HLOOKUP(Table2[[#This Row],[Catch crop]], Tool!C$29:M$29,1,0)","v":{"$error":"#N/A"}},50,{"$f":"100-Table2[[#This Row],[Achieved]]","v":50}]
["Alelopatinis poveikis","Privalumai: ligų ir piktžolių kontrolė","Šakniniai ridikai","Very good",3,{"$f":"HLOOKUP(Table2[[#This Row],[Catch crop]], Tool!C$29:M$29,1,0)","v":{"$error":"#N/A"}},75,{"$f":"100-Table2[[#This Row],[Achieved]]","v":25}]
["Piktžolių stelbimas","Privalumai: ligų ir piktžolių kontrolė","Šakniniai ridikai","Very good",3,{"$f":"HLOOKUP(Table2[[#This Row],[Catch crop]], Tool!C$29:M$29,1,0)","v":{"$error":"#N/A"}},50,{"$f":"100-Table2[[#This Row],[Achieved]]","v":50}]
["Naudingų vabzdžių pritraukimas","Privalumai: poveikis dirvožemiui","Šakniniai ridikai","Fair",1,{"$f":"HLOOKUP(Table2[[#This Row],[Catch crop]], Tool!C$29:M$29,1,0)","v":{"$error":"#N/A"}},75,{"$f":"100-Table2[[#This Row],[Achieved]]","v":25}]
["Tinkamumas trumpam laikotarpiui","Privalumai: poveikis dirvožemiui","Šakniniai ridikai","Very good",3,{"$f":"HLOOKUP(Table2[[#This Row],[Catch crop]], Tool!C$29:M$29,1,0)","v":{"$error":"#N/A"}},25,{"$f":"100-Table2[[#This Row],[Achieved]]","v":75}]
["Perteklinio azoto sulaikymas","Veiksmingumas ir funkcijos","Žieminiai rapsiukai","Very good",3,{"$f":"HLOOKUP(Table2[[#This Row],[Catch crop]], Tool!C$29:M$29,1,0)","v":"Žieminiai rapsiukai"},100,{"$f":"100-Table2[[#This Row],[Achieved]]","v":0}]
["Organinės medžiagos kiekio didinimas","Veiksmingumas ir funkcijos","Žieminiai rapsiukai","Very good",3,{"$f":"HLOOKUP(Table2[[#This Row],[Catch crop]], Tool!C$29:M$29,1,0)","v":"Žieminiai rapsiukai"},null,{"$f":"100-Table2[[#This Row],[Achieved]]","v":100}]
["Erozijos mažinimas","Veiksmingumas ir funkcijos","Žieminiai rapsiukai","Excellent",4,{"$f":"HLOOKUP(Table2[[#This Row],[Catch crop]], Tool!C$29:M$29,1,0)","v":"Žieminiai rapsiukai"},null,{"$f":"100-Table2[[#This Row],[Achieved]]","v":100}]
["Piktžolėtumo mažinimas","Veiksmingumas ir funkcijos","Žieminiai rapsiukai","Very good",3,{"$f":"HLOOKUP(Table2[[#This Row],[Catch crop]], Tool!C$29:M$29,1,0)","v":"Žieminiai rapsiukai"},null,{"$f":"100-Table2[[#This Row],[Achieved]]","v":100}]
["Greitas augimas","Veiksmingumas ir funkcijos","Žieminiai rapsiukai","Excellent",4,{"$f":"HLOOKUP(Table2[[#This Row],[Catch crop]], Tool!C$29:M$29,1,0)","v":"Žieminiai rapsiukai"},null,{"$f":"100-Table2[[#This Row],[Achieved]]","v":100}]
["Liekanų ilgaamžiškumas","Veiksmingumas ir funkcijos","Žieminiai rapsiukai","Excellent",4,{"$f":"HLOOKUP(Table2[[#This Row],[Catch crop]], Tool!C$29:M$29,1,0)","v":"Žieminiai rapsiukai"},null,{"$f":"100-Table2[[#This Row],[Achieved]]","v":100}]
["Tinkamumas augti su pagrindiniu pasėliu","Veiksmingumas ir funkcijos","Žieminiai rapsiukai","Fair",1,{"$f":"HLOOKUP(Table2[[#This Row],[Catch crop]], Tool!C$29:M$29,1,0)","v":"Žieminiai rapsiukai"},null,{"$f":"100-Table2[[#This Row],[Achieved]]","v":100}]
["Atsparumas šalčiui/ šalnoms","Atsparumas/ pakantumas","Žieminiai rapsiukai","Good",2,{"$f":"HLOOKUP(Table2[[#This Row],[Catch crop]], Tool!C$29:M$29,1,0)","v":"Žieminiai rapsiukai"},null,{"$f":"100-Table2[[#This Row],[Achieved]]","v":100}]
["Pakantumas kaitrai","Atsparumas/ pakantumas","Žieminiai rapsiukai","Fair",1,{"$f":"HLOOKUP(Table2[[#This Row],[Catch crop]], Tool!C$29:M$29,1,0)","v":"Žieminiai rapsiukai"},null,{"$f":"100-Table2[[#This Row],[Achieved]]","v":100}]
["Pakantumas sausrai","Atsparumas/ pakantumas","Žieminiai rapsiukai","Fair",1,{"$f":"HLOOKUP(Table2[[#This Row],[Catch crop]], Tool!C$29:M$29,1,0)","v":"Žieminiai rapsiukai"},null,{"$f":"100-Table2[[#This Row],[Achieved]]","v":100}]
["Paunksmės toleravimas","Atsparumas/ pakantumas","Žieminiai rapsiukai","Good",2,{"$f":"HLOOKUP(Table2[[#This Row],[Catch crop]], Tool!C$29:M$29,1,0)","v":"Žieminiai rapsiukai"},null,{"$f":"100-Table2[[#This Row],[Achieved]]","v":100}]
["Pakantumas užtvindymui","Atsparumas/ pakantumas","Žieminiai rapsiukai","Fair",1,{"$f":"HLOOKUP(Table2[[#This Row],[Catch crop]], Tool!C$29:M$29,1,0)","v":"Žieminiai rapsiukai"},null,{"$f":"100-Table2[[#This Row],[Achieved]]","v":100}]
["Pakantumas nederlingoms dirvoms","Atsparumas/ pakantumas","Žieminiai rapsiukai","Fair",1,{"$f":"HLOOKUP(Table2[[#This Row],[Catch crop]], Tool!C$29:M$29,1,0)","v":"Žieminiai rapsiukai"},null,{"$f":"100-Table2[[#This Row],[Achieved]]","v":100}]
["Podirvio purenimas","Privalumai: poveikis dirvožemiui","Žieminiai rapsiukai","Very good",3,{"$f":"HLOOKUP(Table2[[#This Row],[Catch crop]], Tool!C$29:M$29,1,0)","v":"Žieminiai rapsiukai"},null,{"$f":"100-Table2[[#This Row],[Achieved]]","v":100}]
["Judriųjų P ir K gausinimas","Privalumai: poveikis dirvožemiui","Žieminiai rapsiukai","Good",2,{"$f":"HLOOKUP(Table2[[#This Row],[Catch crop]], Tool!C$29:M$29,1,0)","v":"Žieminiai rapsiukai"},null,{"$f":"100-Table2[[#This Row],[Achieved]]","v":100}]
["Armens purenimas","Privalumai: poveikis dirvožemiui","Žieminiai rapsiukai","Very good",3,{"$f":"HLOOKUP(Table2[[#This Row],[Catch crop]], Tool!C$29:M$29,1,0)","v":"Žieminiai rapsiukai"},null,{"$f":"100-Table2[[#This Row],[Achieved]]","v":100}]
["Nematodų kontrolė","Privalumai: ligų ir piktžolių kontrolė","Žieminiai rapsiukai","Very good",3,{"$f":"HLOOKUP(Table2[[#This Row],[Catch crop]], Tool!C$29:M$29,1,0)","v":"Žieminiai rapsiukai"},null,{"$f":"100-Table2[[#This Row],[Achieved]]","v":100}]
["Ligų kontrolė","Privalumai: ligų ir piktžolių kontrolė","Žieminiai rapsiukai","Good",2,{"$f":"HLOOKUP(Table2[[#This Row],[Catch crop]], Tool!C$29:M$29,1,0)","v":"Žieminiai rapsiukai"},null,{"$f":"100-Table2[[#This Row],[Achieved]]","v":100}]
["Alelopatinis poveikis","Privalumai: ligų ir piktžolių kontrolė","Žieminiai rapsiukai","Very good",3,{"$f":"HLOOKUP(Table2[[#This Row],[Catch crop]], Tool!C$29:M$29,1,0)","v":"Žieminiai rapsiukai"},null,{"$f":"100-Table2[[#This Row],[Achieved]]","v":100}]
["Piktžolių stelbimas","Privalumai: ligų ir piktžolių kontrolė","Žieminiai rapsiukai","Very good",3,{"$f":"HLOOKUP(Table2[[#This Row],[Catch crop]], Tool!C$29:M$29,1,0)","v":"Žieminiai rapsiukai"},null,{"$f":"100-Table2[[#This Row],[Achieved]]","v":100}]
["Naudingų vabzdžių pritraukimas","Privalumai: poveikis dirvožemiui","Žieminiai rapsiukai","Fair",1,{"$f":"HLOOKUP(Table2[[#This Row],[Catch crop]], Tool!C$29:M$29,1,0)","v":"Žieminiai rapsiukai"},null,{"$f":"100-Table2[[#This Row],[Achieved]]","v":100}]
["Tinkamumas trumpam laikotarpiui","Privalumai: poveikis dirvožemiui","Žieminiai rapsiukai","Very good",3,{"$f":"HLOOKUP(Table2[[#This Row],[Catch crop]], Tool!C$29:M$29,1,0)","v":"Žieminiai rapsiukai"},null,{"$f":"100-Table2[[#This Row],[Achieved]]","v":100}]
["Perteklinio azoto sulaikymas","Veiksmingumas ir funkcijos","Žieminiai rugiai","Very good",3,{"$f":"HLOOKUP(Table2[[#This Row],[Catch crop]], Tool!C$29:M$29,1,0)","v":"Žieminiai rugiai"},null,{"$f":"100-Table2[[#This Row],[Achieved]]","v":100}]
["Organinės medžiagos kiekio didinimas","Veiksmingumas ir funkcijos","Žieminiai rugiai","Very good",3,{"$f":"HLOOKUP(Table2[[#This Row],[Catch crop]], Tool!C$29:M$29,1,0)","v":"Žieminiai rugiai"},null,{"$f":"100-Table2[[#This Row],[Achieved]]","v":100}]
["Erozijos mažinimas","Veiksmingumas ir funkcijos","Žieminiai rugiai","Excellent",4,{"$f":"HLOOKUP(Table2[[#This Row],[Catch crop]], Tool!C$29:M$29,1,0)","v":"Žieminiai rugiai"},null,{"$f":"100-Table2[[#This Row],[Achieved]]","v":100}]
["Piktžolėtumo mažinimas","Veiksmingumas ir funkcijos","Žieminiai rugiai","Excellent",4,{"$f":"HLOOKUP(Table2[[#This Row],[Catch crop]], Tool!C$29:M$29,1,0)","v":"Žieminiai rugiai"},null,{"$f":"100-Table2[[#This Row],[Achieved]]","v":100}]
["Greitas augimas","Veiksmingumas ir funkcijos","Žieminiai rugiai","Excellent",4,{"$f":"HLOOKUP(Table2[[#This Row],[Catch crop]], Tool!C$29:M$29,1,0)","v":"Žieminiai rugiai"},null,{"$f":"100-Table2[[#This Row],[Achieved]]","v":100}]
["Liekanų ilgaamžiškumas","Veiksmingumas ir funkcijos","Žieminiai rugiai","Excellent",4,{"$f":"HLOOKUP(Table2[[#This Row],[Catch crop]], Tool!C$29:M$29,1,0)","v":"Žieminiai rugiai"},null,{"$f":"100-Table2[[#This Row],[Achieved]]","v":100}]
["Tinkamumas augti su pagrindiniu pasėliu","Veiksmingumas ir funkcijos","Žieminiai rugiai","Very good",3,{"$f":"HLOOKUP(Table2[[#This Row],[Catch crop]], Tool!C$29:M$29,1,0)","v":"Žieminiai rugiai"},null,{"$f":"100-Table2[[#This Row],[Achieved]]","v":100}]
["Atsparumas šalčiui/ šalnoms","Atsparumas/ pakantumas","Žieminiai rugiai","Excellent",4,{"$f":"HLOOKUP(Table2[[#This Row],[Catch crop]], Tool!C$29:M$29,1,0)","v":"Žieminiai rugiai"},null,{"$f":"100-Table2[[#This Row],[Achieved]]","v":100}]
["Pakantumas kaitrai","Atsparumas/ pakantumas","Žieminiai rugiai","Good",2,{"$f":"HLOOKUP(Table2[[#This Row],[Catch crop]], Tool!C$29:M$29,1,0)","v":"Žieminiai rugiai"},null,{"$f":"100-Table2[[#This Row],[Achieved]]","v":100}]
["Pakantumas sausrai","Atsparumas/ pakantumas","Žieminiai rugiai","Very good",3,{"$f":"HLOOKUP(Table2[[#This Row],[Catch crop]], Tool!C$29:M$29,1,0)","v":"Žieminiai rugiai"},null,{"$f":"100-Table2[[#This Row],[Achieved]]","v":100}]
["Paunksmės toleravimas","Atsparumas/ pakantumas","Žieminiai rugiai","Very good",3,{"$f":"HLOOKUP(Table2[[#This Row],[Catch crop]], Tool!C$29:M$29,1,0)","v":"Žieminiai rugiai"},null,{"$f":"100-Table2[[#This Row],[Achieved]]","v":100}]
["Pakantumas užtvindymui","Atsparumas/ pakantumas","Žieminiai rugiai","Good",2,{"$f":"HLOOKUP(Table2[[#This Row],[Catch crop]], Tool!C$29:M$29,1,0)","v":"Žieminiai rugiai"},null,{"$f":"100-Table2[[#This Row],[Achieved]]","v":100}]
["Pakantumas nederlingoms dirvoms","Atsparumas/ pakantumas","Žieminiai rugiai","Excellent",4,{"$f":"HLOOKUP(Table2[[#This Row],[Catch crop]], Tool!C$29:M$29,1,0)","v":"Žieminiai rugiai"},null,{"$f":"100-Table2[[#This Row],[Achieved]]","v":100}]
["Podirvio purenimas","Privalumai: poveikis dirvožemiui","Žieminiai rugiai","Fair",1,{"$f":"HLOOKUP(Table2[[#This Row],[Catch crop]], Tool!C$29:M$29,1,0)","v":"Žieminiai rugiai"},null,{"$f":"100-Table2[[#This Row],[Achieved]]","v":100}]
["Judriųjų P ir K gausinimas","Privalumai: poveikis dirvožemiui","Žieminiai rugiai","Very good",3,{"$f":"HLOOKUP(Table2[[#This Row],[Catch crop]], Tool!C$29:M$29,1,0)","v":"Žieminiai rugiai"},null,{"$f":"100-Table2[[#This Row],[Achieved]]","v":100}]
["Armens purenimas","Privalumai: poveikis dirvožemiui","Žieminiai rugiai","Excellent",4,{"$f":"HLOOKUP(Table2[[#This Row],[Catch crop]], Tool!C$29:M$29,1,0)","v":"Žieminiai rugiai"},null,{"$f":"100-Table2[[#This Row],[Achieved]]","v":100}]
["Nematodų kontrolė","Privalumai: ligų ir piktžolių kontrolė","Žieminiai rugiai","Good",2,{"$f":"HLOOKUP(Table2[[#This Row],[Catch crop]], Tool!C$29:M$29,1,0)","v":"Žieminiai rugiai"},null,{"$f":"100-Table2[[#This Row],[Achieved]]","v":100}]
["Ligų kontrolė","Privalumai: ligų ir piktžolių kontrolė","Žieminiai rugiai","Very good",3,{"$f":"HLOOKUP(Table2[[#This Row],[Catch crop]], Tool!C$29:M$29,1,0)","v":"Žieminiai rugiai"},null,{"$f":"100-Table2[[#This Row],[Achieved]]","v":100}]
["Alelopatinis poveikis","Privalumai: ligų ir piktžolių kontrolė","Žieminiai rugiai","Excellent",4,{"$f":"HLOOKUP(Table2[[#This Row],[Catch crop]], Tool!C$29:M$29,1,0)","v":"Žieminiai rugiai"},null,{"$f":"100-Table2[[#This Row],[Achieved]]","v":100}]
["Piktžolių stelbimas","Privalumai: ligų ir piktžolių kontrolė","Žieminiai rugiai","Excellent",4,{"$f":"HLOOKUP(Table2[[#This Row],[Catch crop]], Tool!C$29:M$29,1,0)","v":"Žieminiai rugiai"},null,{"$f":"100-Table2[[#This Row],[Achieved]]","v":100}]
["Naudingų vabzdžių pritraukimas","Privalumai: poveikis dirvožemiui","Žieminiai rugiai","Fair",1,{"$f":"HLOOKUP(Table2[[#This Row],[Catch crop]], Tool!C$29:M$29,1,0)","v":"Žieminiai rugiai"},null,{"$f":"100-Table2[[#This Row],[Achieved]]","v":100}]
["Tinkamumas trumpam laikotarpiui","Privalumai: poveikis dirvožemiui","Žieminiai rugiai","Excellent",4,{"$f":"HLOOKUP(Table2[[#This Row],[Catch crop]], Tool!C$29:M$29,1,0)","v":"Žieminiai rugiai"},null,{"$f":"100-Table2[[#This Row],[Achieved]]","v":100}]
["Perteklinio azoto sulaikymas","Veiksmingumas ir funkcijos","Baltieji dobilai","Fair",1,{"$f":"HLOOKUP(Table2[[#This Row],[Catch crop]], Tool!C$29:M$29,1,0)","v":{"$error":"#N/A"}},null,{"$f":"100-Table2[[#This Row],[Achieved]]","v":100}]
["Organinės medžiagos kiekio didinimas","Veiksmingumas ir funkcijos","Baltieji dobilai","Good",2,{"$f":"HLOOKUP(Table2[[#This Row],[Catch crop]], Tool!C$29:M$29,1,0)","v":{"$error":"#N/A"}},null,{"$f":"100-Table2[[#This Row],[Achieved]]","v":100}]
["Erozijos mažinimas","Veiksmingumas ir funkcijos","Baltieji dobilai","Very good",3,{"$f":"HLOOKUP(Table2[[#This Row],[Catch crop]], Tool!C$29:M$29,1,0)","v":{"$error":"#N/A"}},null,{"$f":"100-Table2[[#This Row],[Achieved]]","v":100}]
["Piktžolėtumo mažinimas","Veiksmingumas ir funkcijos","Baltieji dobilai","Good",2,{"$f":"HLOOKUP(Table2[[#This Row],[Catch crop]], Tool!C$29:M$29,1,0)","v":{"$error":"#N/A"}},null,{"$f":"100-Table2[[#This Row],[Achieved]]","v":100}]
["Greitas augimas","Veiksmingumas ir funkcijos","Baltieji dobilai","Fair",1,{"$f":"HLOOKUP(Table2[[#This Row],[Catch crop]], Tool!C$29:M$29,1,0)","v":{"$error":"#N/A"}},null,{"$f":"100-Table2[[#This Row],[Achieved]]","v":100}]
["Liekanų ilgaamžiškumas","Veiksmingumas ir funkcijos","Baltieji dobilai","Fair",1,{"$f":"HLOOKUP(Table2[[#This Row],[Catch crop]], Tool!C$29:M$29,1,0)","v":{"$error":"#N/A"}},null,{"$f":"100-Table2[[#This Row],[Achieved]]","v":100}]
["Tinkamumas augti su pagrindiniu pasėliu","Veiksmingumas ir funkcijos","Baltieji dobilai","Very good",3,{"$f":"HLOOKUP(Table2[[#This Row],[Catch crop]], Tool!C$29:M$29,1,0)","v":{"$error":"#N/A"}},null,{"$f":"100-Table2[[#This Row],[Achieved]]","v":100}]
["Atsparumas šalčiui/ šalnoms","Atsparumas/ pakantumas","Baltieji dobilai","Excellent",4,{"$f":"HLOOKUP(Table2[[#This Row],[Catch crop]], Tool!C$29:M$29,1,0)","v":{"$error":"#N/A"}},null,{"$f":"100-Table2[[#This Row],[Achieved]]","v":100}]
["Pakantumas kaitrai","Atsparumas/ pakantumas","Baltieji dobilai","Good",2,{"$f":"HLOOKUP(Table2[[#This Row],[Catch crop]], Tool!C$29:M$29,1,0)","v":{"$error":"#N/A"}},null,{"$f":"100-Table2[[#This Row],[Achieved]]","v":100}]
["Pakantumas sausrai","Atsparumas/ pakantumas","Baltieji dobilai","Good",2,{"$f":"HLOOKUP(Table2[[#This Row],[Catch crop]], Tool!C$29:M$29,1,0)","v":{"$error":"#N/A"}},null,{"$f":"100-Table2[[#This Row],[Achieved]]","v":100}]
["Paunksmės toleravimas","Atsparumas/ pakantumas","Baltieji dobilai","Very good",3,{"$f":"HLOOKUP(Table2[[#This Row],[Catch crop]], Tool!C$29:M$29,1,0)","v":{"$error":"#N/A"}},null,{"$f":"100-Table2[[#This Row],[Achieved]]","v":100}]
["Pakantumas užtvindymui","Atsparumas/ pakantumas","Baltieji dobilai","Very good",3,{"$f":"HLOOKUP(Table2[[#This Row],[Catch crop]], Tool!C$29:M$29,1,0)","v":{"$error":"#N/A"}},null,{"$f":"100-Table2[[#This Row],[Achieved]]","v":100}]
["Pakantumas nederlingoms dirvoms","Atsparumas/ pakantumas","Baltieji dobilai","Good",2,{"$f":"HLOOKUP(Table2[[#This Row],[Catch crop]], Tool!C$29:M$29,1,0)","v":{"$error":"#N/A"}},null,{"$f":"100-Table2[[#This Row],[Achieved]]","v":100}]
["Podirvio purenimas","Privalumai: poveikis dirvožemiui","Baltieji dobilai","Fair",1,{"$f":"HLOOKUP(Table2[[#This Row],[Catch crop]], Tool!C$29:M$29,1,0)","v":{"$error":"#N/A"}},null,{"$f":"100-Table2[[#This Row],[Achieved]]","v":100}]
["Judriųjų P ir K gausinimas","Privalumai: poveikis dirvožemiui","Baltieji dobilai","Fair",1,{"$f":"HLOOKUP(Table2[[#This Row],[Catch crop]], Tool!C$29:M$29,1,0)","v":{"$error":"#N/A"}},null,{"$f":"100-Table2[[#This Row],[Achieved]]","v":100}]
["Armens purenimas","Privalumai: poveikis dirvožemiui","Baltieji dobilai","Very good",3,{"$f":"HLOOKUP(Table2[[#This Row],[Catch crop]], Tool!C$29:M$29,1,0)","v":{"$error":"#N/A"}},null,{"$f":"100-Table2[[#This Row],[Achieved]]","v":100}]
["Nematodų kontrolė","Privalumai: ligų ir piktžolių kontrolė","Baltieji dobilai","Poor",0,{"$f":"HLOOKUP(Table2[[#This Row],[Catch crop]], Tool!C$29:M$29,1,0)","v":{"$error":"#N/A"}},null,{"$f":"100-Table2[[#This Row],[Achieved]]","v":100}]
["Ligų kontrolė","Privalumai: ligų ir piktžolių kontrolė","Baltieji dobilai","Poor",0,{"$f":"HLOOKUP(Table2[[#This Row],[Catch crop]], Tool!C$29:M$29,1,0)","v":{"$error":"#N/A"}},null,{"$f":"100-Table2[[#This Row],[Achieved]]","v":100}]
["Alelopatinis poveikis","Privalumai: ligų ir piktžolių kontrolė","Baltieji dobilai","Good",2,{"$f":"HLOOKUP(Table2[[#This Row],[Catch crop]], Tool!C$29:M$29,1,0)","v":{"$error":"#N/A"}},null,{"$f":"100-Table2[[#This Row],[Achieved]]","v":100}]
["Piktžolių stelbimas","Privalumai: ligų ir piktžolių kontrolė","Baltieji dobilai","Very good",3,{"$f":"HLOOKUP(Table2[[#This Row],[Catch crop]], Tool!C$29:M$29,1,0)","v":{"$error":"#N/A"}},null,{"$f":"100-Table2[[#This Row],[Achieved]]","v":100}]
["Naudingų vabzdžių pritraukimas","Privalumai: poveikis dirvožemiui","Baltieji dobilai","Good",2,{"$f":"HLOOKUP(Table2[[#This Row],[Catch crop]], Tool!C$29:M$29,1,0)","v":{"$error":"#N/A"}},null,{"$f":"100-Table2[[#This Row],[Achieved]]","v":100}]
["Tinkamumas trumpam laikotarpiui","Privalumai: poveikis dirvožemiui","Baltieji dobilai","Good",2,{"$f":"HLOOKUP(Table2[[#This Row],[Catch crop]], Tool!C$29:M$29,1,0)","v":{"$error":"#N/A"}},null,{"$f":"100-Table2[[#This Row],[Achieved]]","v":100}]
["Perteklinio azoto sulaikymas","Veiksmingumas ir funkcijos","Raudonieji dobilai","Fair",1,{"$f":"HLOOKUP(Table2[[#This Row],[Catch crop]], Tool!C$29:M$29,1,0)","v":{"$error":"#N/A"}},null,{"$f":"100-Table2[[#This Row],[Achieved]]","v":100}]
["Organinės medžiagos kiekio didinimas","Veiksmingumas ir funkcijos","Raudonieji dobilai","Very good",3,{"$f":"HLOOKUP(Table2[[#This Row],[Catch crop]], Tool!C$29:M$29,1,0)","v":{"$error":"#N/A"}},null,{"$f":"100-Table2[[#This Row],[Achieved]]","v":100}]
["Erozijos mažinimas","Veiksmingumas ir funkcijos","Raudonieji dobilai","Good",2,{"$f":"HLOOKUP(Table2[[#This Row],[Catch crop]], Tool!C$29:M$29,1,0)","v":{"$error":"#N/A"}},null,{"$f":"100-Table2[[#This Row],[Achieved]]","v":100}]
["Piktžolėtumo mažinimas","Veiksmingumas ir funkcijos","Raudonieji dobilai","Good",2,{"$f":"HLOOKUP(Table2[[#This Row],[Catch crop]], Tool!C$29:M$29,1,0)","v":{"$error":"#N/A"}},null,{"$f":"100-Table2[[#This Row],[Achieved]]","v":100}]
["Greitas augimas","Veiksmingumas ir funkcijos","Raudonieji dobilai","Fair",1,{"$f":"HLOOKUP(Table2[[#This Row],[Catch crop]], Tool!C$29:M$29,1,0)","v":{"$error":"#N/A"}},null,{"$f":"100-Table2[[#This Row],[Achieved]]","v":100}]
["Liekanų ilgaamžiškumas","Veiksmingumas ir funkcijos","Raudonieji dobilai","Fair",1,{"$f":"HLOOKUP(Table2[[#This Row],[Catch crop]], Tool!C$29:M$29,1,0)","v":{"$error":"#N/A"}},null,{"$f":"100-Table2[[#This Row],[Achieved]]","v":100}]
["Tinkamumas augti su pagrindiniu pasėliu","Veiksmingumas ir funkcijos","Raudonieji dobilai","Excellent",4,{"$f":"HLOOKUP(Table2[[#This Row],[Catch crop]], Tool!C$29:M$29,1,0)","v":{"$error":"#N/A"}},null,{"$f":"100-Table2[[#This Row],[Achieved]]","v":100}]
["Atsparumas šalčiui/ šalnoms","Atsparumas/ pakantumas","Raudonieji dobilai","Excellent",4,{"$f":"HLOOKUP(Table2[[#This Row],[Catch crop]], Tool!C$29:M$29,1,0)","v":{"$error":"#N/A"}},null,{"$f":"100-Table2[[#This Row],[Achieved]]","v":100}]
["Pakantumas kaitrai","Atsparumas/ pakantumas","Raudonieji dobilai","Fair",1,{"$f":"HLOOKUP(Table2[[#This Row],[Catch crop]], Tool!C$29:M$29,1,0)","v":{"$error":"#N/A"}},null,{"$f":"100-Table2[[#This Row],[Achieved]]","v":100}]
["Pakantumas sausrai","Atsparumas/ pakantumas","Raudonieji dobilai","Fair",1,{"$f":"HLOOKUP(Table2[[#This Row],[Catch crop]], Tool!C$29:M$29,1,0)","v":{"$error":"#N/A"}},null,{"$f":"100-Table2[[#This Row],[Achieved]]","v":100}]
["Paunksmės toleravimas","Atsparumas/ pakantumas","Raudonieji dobilai","Very good",3,{"$f":"HLOOKUP(Table2[[#This Row],[Catch crop]], Tool!C$29:M$29,1,0)","v":{"$error":"#N/A"}},null,{"$f":"100-Table2[[#This Row],[Achieved]]","v":100}]
["Pakantumas užtvindymui","Atsparumas/ pakantumas","Raudonieji dobilai","Good",2,{"$f":"HLOOKUP(Table2[[#This Row],[Catch crop]], Tool!C$29:M$29,1,0)","v":{"$error":"#N/A"}},null,{"$f":"100-Table2[[#This Row],[Achieved]]","v":100}]
["Pakantumas nederlingoms dirvoms","Atsparumas/ pakantumas","Raudonieji dobilai","Fair",1,{"$f":"HLOOKUP(Table2[[#This Row],[Catch crop]], Tool!C$29:M$29,1,0)","v":{"$error":"#N/A"}},null,{"$f":"100-Table2[[#This Row],[Achieved]]","v":100}]
["Podirvio purenimas","Privalumai: poveikis dirvožemiui","Raudonieji dobilai","Excellent",4,{"$f":"HLOOKUP(Table2[[#This Row],[Catch crop]], Tool!C$29:M$29,1,0)","v":{"$error":"#N/A"}},null,{"$f":"100-Table2[[#This Row],[Achieved]]","v":100}]
["Judriųjų P ir K gausinimas","Privalumai: poveikis dirvožemiui","Raudonieji dobilai","Very good",3,{"$f":"HLOOKUP(Table2[[#This Row],[Catch crop]], Tool!C$29:M$29,1,0)","v":{"$error":"#N/A"}},null,{"$f":"100-Table2[[#This Row],[Achieved]]","v":100}]
["Armens purenimas","Privalumai: poveikis dirvožemiui","Raudonieji dobilai","Good",2,{"$f":"HLOOKUP(Table2[[#This Row],[Catch crop]], Tool!C$29:M$29,1,0)","v":{"$error":"#N/A"}},null,{"$f":"100-Table2[[#This Row],[Achieved]]","v":100}]
["Nematodų kontrolė","Privalumai: ligų ir piktžolių kontrolė","Raudonieji dobilai","Fair",1,{"$f":"HLOOKUP(Table2[[#This Row],[Catch crop]], Tool!C$29:M$29,1,0)","v":{"$error":"#N/A"}},null,{"$f":"100-Table2[[#This Row],[Achieved]]","v":100}]
["Ligų kontrolė","Privalumai: ligų ir piktžolių kontrolė","Raudonieji dobilai","Fair",1,{"$f":"HLOOKUP(Table2[[#This Row],[Catch crop]], Tool!C$29:M$29,1,0)","v":{"$error":"#N/A"}},null,{"$f":"100-Table2[[#This Row],[Achieved]]","v":100}]
["Alelopatinis poveikis","Privalumai: ligų ir piktžolių kontrolė","Raudonieji dobilai","Good",2,{"$f":"HLOOKUP(Table2[[#This Row],[Catch crop]], Tool!C$29:M$29,1,0)","v":{"$error":"#N/A"}},null,{"$f":"100-Table2[[#This Row],[Achieved]]","v":100}]
["Piktžolių stelbimas","Privalumai: ligų ir piktžolių kontrolė","Raudonieji dobilai","Good",2,{"$f":"HLOOKUP(Table2[[#This Row],[Catch crop]], Tool!C$29:M$29,1,0)","v":{"$error":"#N/A"}},null,{"$f":"100-Table2[[#This Row],[Achieved]]","v":100}]
["Naudingų vabzdžių pritraukimas","Privalumai: poveikis dirvožemiui","Raudonieji dobilai","Very good",3,{"$f":"HLOOKUP(Table2[[#This Row],[Catch crop]], Tool!C$29:M$29,1,0)","v":{"$error":"#N/A"}},null,{"$f":"100-Table2[[#This Row],[Achieved]]","v":100}]
["Tinkamumas trumpam laikotarpiui","Privalumai: poveikis dirvožemiui","Raudonieji dobilai","Good",2,{"$f":"HLOOKUP(Table2[[#This Row],[Catch crop]], Tool!C$29:M$29,1,0)","v":{"$error":"#N/A"}},null,{"$f":"100-Table2[[#This Row],[Achieved]]","v":100}]
["Perteklinio azoto sulaikymas","Veiksmingumas ir funkcijos","Baltažiedžiai barkūnai","Good",2,{"$f":"HLOOKUP(Table2[[#This Row],[Catch crop]], Tool!C$29:M$29,1,0)","v":{"$error":"#N/A"}},null,{"$f":"100-Table2[[#This Row],[Achieved]]","v":100}]
["Organinės medžiagos kiekio didinimas","Veiksmingumas ir funkcijos","Baltažiedžiai barkūnai","Very good",3,{"$f":"HLOOKUP(Table2[[#This Row],[Catch crop]], Tool!C$29:M$29,1,0)","v":{"$error":"#N/A"}},null,{"$f":"100-Table2[[#This Row],[Achieved]]","v":100}]
["Erozijos mažinimas","Veiksmingumas ir funkcijos","Baltažiedžiai barkūnai","Very good",3,{"$f":"HLOOKUP(Table2[[#This Row],[Catch crop]], Tool!C$29:M$29,1,0)","v":{"$error":"#N/A"}},null,{"$f":"100-Table2[[#This Row],[Achieved]]","v":100}]
["Piktžolėtumo mažinimas","Veiksmingumas ir funkcijos","Baltažiedžiai barkūnai","Good",2,{"$f":"HLOOKUP(Table2[[#This Row],[Catch crop]], Tool!C$29:M$29,1,0)","v":{"$error":"#N/A"}},null,{"$f":"100-Table2[[#This Row],[Achieved]]","v":100}]
["Greitas augimas","Veiksmingumas ir funkcijos","Baltažiedžiai barkūnai","Good",2,{"$f":"HLOOKUP(Table2[[#This Row],[Catch crop]], Tool!C$29:M$29,1,0)","v":{"$error":"#N/A"}},null,{"$f":"100-Table2[[#This Row],[Achieved]]","v":100}]
["Liekanų ilgaamžiškumas","Veiksmingumas ir funkcijos","Baltažiedžiai barkūnai","Very good",3,{"$f":"HLOOKUP(Table2[[#This Row],[Catch crop]], Tool!C$29:M$29,1,0)","v":{"$error":"#N/A"}},null,{"$f":"100-Table2[[#This Row],[Achieved]]","v":100}]
["Tinkamumas augti su pagrindiniu pasėliu","Veiksmingumas ir funkcijos","Baltažiedžiai barkūnai","Good",2,{"$f":"HLOOKUP(Table2[[#This Row],[Catch crop]], Tool!C$29:M$29,1,0)","v":{"$error":"#N/A"}},null,{"$f":"100-Table2[[#This Row],[Achieved]]","v":100}]
["Atsparumas šalčiui/ šalnoms","Atsparumas/ pakantumas","Baltažiedžiai barkūnai","Excellent",4,{"$f":"HLOOKUP(Table2[[#This Row],[Catch crop]], Tool!C$29:M$29,1,0)","v":{"$error":"#N/A"}},null,{"$f":"100-Table2[[#This Row],[Achieved]]","v":100}]
["Pakantumas kaitrai","Atsparumas/ pakantumas","Baltažiedžiai barkūnai","Very good",3,{"$f":"HLOOKUP(Table2[[#This Row],[Catch crop]], Tool!C$29:M$29,1,0)","v":{"$error":"#N/A"}},null,{"$f":"100-Table2[[#This Row],[Achieved]]","v":100}]
["Pakantumas sausrai","Atsparumas/ pakantumas","Baltažiedžiai barkūnai","Excellent",4,{"$f":"HLOOKUP(Table2[[#This Row],[Catch crop]], Tool!C$29:M$29,1,0)","v":{"$error":"#N/A"}},null,{"$f":"100-Table2[[#This Row],[Achieved]]","v":100}]
["Paunksmės toleravimas","Atsparumas/ pakantumas","Baltažiedžiai barkūnai","Fair",1,{"$f":"HLOOKUP(Table2[[#This Row],[Catch crop]], Tool!C$29:M$29,1,0)","v":{"$error":"#N/A"}},null,{"$f":"100-Table2[[#This Row],[Achieved]]","v":100}]
["Pakantumas užtvindymui","Atsparumas/ pakantumas","Baltažiedžiai barkūnai","Fair",1,{"$f":"HLOOKUP(Table2[[#This Row],[Catch crop]], Tool!C$29:M$29,1,0)","v":{"$error":"#N/A"}},null,{"$f":"100-Table2[[#This Row],[Achieved]]","v":100}]
["Pakantumas nederlingoms dirvoms","Atsparumas/ pakantumas","Baltažiedžiai barkūnai","Excellent",4,{"$f":"HLOOKUP(Table2[[#This Row],[Catch crop]], Tool!C$29:M$29,1,0)","v":{"$error":"#N/A"}},null,{"$f":"100-Table2[[#This Row],[Achieved]]","v":100}]
["Podirvio purenimas","Privalumai: poveikis dirvožemiui","Baltažiedžiai barkūnai","Excellent",4,{"$f":"HLOOKUP(Table2[[#This Row],[Catch crop]], Tool!C$29:M$29,1,0)","v":{"$error":"#N/A"}},null,{"$f":"100-Table2[[#This Row],[Achieved]]","v":100}]
["Judriųjų P ir K gausinimas","Privalumai: poveikis dirvožemiui","Baltažiedžiai barkūnai","Excellent",4,{"$f":"HLOOKUP(Table2[[#This Row],[Catch crop]], Tool!C$29:M$29,1,0)","v":{"$error":"#N/A"}},null,{"$f":"100-Table2[[#This Row],[Achieved]]","v":100}]
["Armens purenimas","Privalumai: poveikis dirvožemiui","Baltažiedžiai barkūnai","Excellent",4,{"$f":"HLOOKUP(Table2[[#This Row],[Catch crop]], Tool!C$29:M$29,1,0)","v":{"$error":"#N/A"}},null,{"$f":"100-Table2[[#This Row],[Achieved]]","v":100}]
["Nematodų kontrolė","Privalumai: ligų ir piktžolių kontrolė","Baltažiedžiai barkūnai","Fair",1,{"$f":"HLOOKUP(Table2[[#This Row],[Catch crop]], Tool!C$29:M$29,1,0)","v":{"$error":"#N/A"}},null,{"$f":"100-Table2[[#This Row],[Achieved]]","v":100}]
["Ligų kontrolė","Privalumai: ligų ir piktžolių kontrolė","Baltažiedžiai barkūnai","Fair",1,{"$f":"HLOOKUP(Table2[[#This Row],[Catch crop]], Tool!C$29:M$29,1,0)","v":{"$error":"#N/A"}},null,{"$f":"100-Table2[[#This Row],[Achieved]]","v":100}]
["Alelopatinis poveikis","Privalumai: ligų ir piktžolių kontrolė","Baltažiedžiai barkūnai","Fair",1,{"$f":"HLOOKUP(Table2[[#This Row],[Catch crop]], Tool!C$29:M$29,1,0)","v":{"$error":"#N/A"}},null,{"$f":"100-Table2[[#This Row],[Achieved]]","v":100}]
["Piktžolių stelbimas","Privalumai: ligų ir piktžolių kontrolė","Baltažiedžiai barkūnai","Good",2,{"$f":"HLOOKUP(Table2[[#This Row],[Catch crop]], Tool!C$29:M$29,1,0)","v":{"$error":"#N/A"}},null,{"$f":"100-Table2[[#This Row],[Achieved]]","v":100}]
["Naudingų vabzdžių pritraukimas","Privalumai: poveikis dirvožemiui","Baltažiedžiai barkūnai","Very good",3,{"$f":"HLOOKUP(Table2[[#This Row],[Catch crop]], Tool!C$29:M$29,1,0)","v":{"$error":"#N/A"}},null,{"$f":"100-Table2[[#This Row],[Achieved]]","v":100}]
["Tinkamumas trumpam laikotarpiui","Privalumai: poveikis dirvožemiui","Baltažiedžiai barkūnai","Poor",0,{"$f":"HLOOKUP(Table2[[#This Row],[Catch crop]], Tool!C$29:M$29,1,0)","v":{"$error":"#N/A"}},null,{"$f":"100-Table2[[#This Row],[Achieved]]","v":100}]
["Perteklinio azoto sulaikymas","Veiksmingumas ir funkcijos","Gausiažiedės svidrės","Very good",3,{"$f":"HLOOKUP(Table2[[#This Row],[Catch crop]], Tool!C$29:M$29,1,0)","v":{"$error":"#N/A"}},null,{"$f":"100-Table2[[#This Row],[Achieved]]","v":100}]
["Organinės medžiagos kiekio didinimas","Veiksmingumas ir funkcijos","Gausiažiedės svidrės","Very good",3,{"$f":"HLOOKUP(Table2[[#This Row],[Catch crop]], Tool!C$29:M$29,1,0)","v":{"$error":"#N/A"}},null,{"$f":"100-Table2[[#This Row],[Achieved]]","v":100}]
["Erozijos mažinimas","Veiksmingumas ir funkcijos","Gausiažiedės svidrės","Very good",3,{"$f":"HLOOKUP(Table2[[#This Row],[Catch crop]], Tool!C$29:M$29,1,0)","v":{"$error":"#N/A"}},null,{"$f":"100-Table2[[#This Row],[Achieved]]","v":100}]
["Piktžolėtumo mažinimas","Veiksmingumas ir funkcijos","Gausiažiedės svidrės","Good",2,{"$f":"HLOOKUP(Table2[[#This Row],[Catch crop]], Tool!C$29:M$29,1,0)","v":{"$error":"#N/A"}},null,{"$f":"100-Table2[[#This Row],[Achieved]]","v":100}]
["Greitas augimas","Veiksmingumas ir funkcijos","Gausiažiedės svidrės","Very good",3,{"$f":"HLOOKUP(Table2[[#This Row],[Catch crop]], Tool!C$29:M$29,1,0)","v":{"$error":"#N/A"}},null,{"$f":"100-Table2[[#This Row],[Achieved]]","v":100}]
["Liekanų ilgaamžiškumas","Veiksmingumas ir funkcijos","Gausiažiedės svidrės","Very good",3,{"$f":"HLOOKUP(Table2[[#This Row],[Catch crop]], Tool!C$29:M$29,1,0)","v":{"$error":"#N/A"}},null,{"$f":"100-Table2[[#This Row],[Achieved]]","v":100}]
["Tinkamumas augti su pagrindiniu pasėliu","Veiksmingumas ir funkcijos","Gausiažiedės svidrės","Excellent",4,{"$f":"HLOOKUP(Table2[[#This Row],[Catch crop]], Tool!C$29:M$29,1,0)","v":{"$error":"#N/A"}},null,{"$f":"100-Table2[[#This Row],[Achieved]]","v":100}]
["Atsparumas šalčiui/ šalnoms","Atsparumas/ pakantumas","Gausiažiedės svidrės","Fair",1,{"$f":"HLOOKUP(Table2[[#This Row],[Catch crop]], Tool!C$29:M$29,1,0)","v":{"$error":"#N/A"}},null,{"$f":"100-Table2[[#This Row],[Achieved]]","v":100}]
["Pakantumas kaitrai","Atsparumas/ pakantumas","Gausiažiedės svidrės","Fair",1,{"$f":"HLOOKUP(Table2[[#This Row],[Catch crop]], Tool!C$29:M$29,1,0)","v":{"$error":"#N/A"}},null,{"$f":"100-Table2[[#This Row],[Achieved]]","v":100}]
["Pakantumas sausrai","Atsparumas/ pakantumas","Gausiažiedės svidrės","Fair",1,{"$f":"HLOOKUP(Table2[[#This Row],[Catch crop]], Tool!C$29:M$29,1,0)","v":{"$error":"#N/A"}},null,{"$f":"100-Table2[[#This Row],[Achieved]]","v":100}]
["Paunksmės toleravimas","Atsparumas/ pakantumas","Gausiažiedės svidrės","Very good",3,{"$f":"HLOOKUP(Table2[[#This Row],[Catch crop]], Tool!C$29:M$29,1,0)","v":{"$error":"#N/A"}},null,{"$f":"100-Table2[[#This Row],[Achieved]]","v":100}]
["Pakantumas užtvindymui","Atsparumas/ pakantumas","Gausiažiedės svidrės","Very good",3,{"$f":"HLOOKUP(Table2[[#This Row],[Catch crop]], Tool!C$29:M$29,1,0)","v":{"$error":"#N/A"}},null,{"$f":"100-Table2[[#This Row],[Achieved]]","v":100}]
["Pakantumas nederlingoms dirvoms","Atsparumas/ pakantumas","Gausiažiedės svidrės","Fair",1,{"$f":"HLOOKUP(Table2[[#This Row],[Catch crop]], Tool!C$29:M$29,1,0)","v":{"$error":"#N/A"}},null,{"$f":"100-Table2[[#This Row],[Achieved]]","v":100}]
["Podirvio purenimas","Privalumai: poveikis dirvožemiui","Gausiažiedės svidrės","Good",2,{"$f":"HLOOKUP(Table2[[#This Row],[Catch crop]], Tool!C$29:M$29,1,0)","v":{"$error":"#N/A"}},null,{"$f":"100-Table2[[#This Row],[Achieved]]","v":100}]
["Judriųjų P ir K gausinimas","Privalumai: poveikis dirvožemiui","Gausiažiedės svidrės","Good",2,{"$f":"HLOOKUP(Table2[[#This Row],[Catch crop]], Tool!C$29:M$29,1,0)","v":{"$error":"#N/A"}},null,{"$f":"100-Table2[[#This Row],[Achieved]]","v":100}]
["Armens purenimas","Privalumai: poveikis dirvožemiui","Gausiažiedės svidrės","Excellent",4,{"$f":"HLOOKUP(Table2[[#This Row],[Catch crop]], Tool!C$29:M$29,1,0)","v":{"$error":"#N/A"}},null,{"$f":"100-Table2[[#This Row],[Achieved]]","v":100}]
["Nematodų kontrolė","Privalumai: ligų ir piktžolių kontrolė","Gausiažiedės svidrės","Good",2,{"$f":"HLOOKUP(Table2[[#This Row],[Catch crop]], Tool!C$29:M$29,1,0)","v":{"$error":"#N/A"}},null,{"$f":"100-Table2[[#This Row],[Achieved]]","v":100}]
["Ligų kontrolė","Privalumai: ligų ir piktžolių kontrolė","Gausiažiedės svidrės","Good",2,{"$f":"HLOOKUP(Table2[[#This Row],[Catch crop]], Tool!C$29:M$29,1,0)","v":{"$error":"#N/A"}},null,{"$f":"100-Table2[[#This Row],[Achieved]]","v":100}]
["Alelopatinis poveikis","Privalumai: ligų ir piktžolių kontrolė","Gausiažiedės svidrės","Good",2,{"$f":"HLOOKUP(Table2[[#This Row],[Catch crop]], Tool!C$29:M$29,1,0)","v":{"$error":"#N/A"}},null,{"$f":"100-Table2[[#This Row],[Achieved]]","v":100}]
["Piktžolių stelbimas","Privalumai: ligų ir piktžolių kontrolė","Gausiažiedės svidrės","Excellent",4,{"$f":"HLOOKUP(Table2[[#This Row],[Catch crop]], Tool!C$29:M$29,1,0)","v":{"$error":"#N/A"}},null,{"$f":"100-Table2[[#This Row],[Achieved]]","v":100}]
["Naudingų vabzdžių pritraukimas","Privalumai: poveikis dirvožemiui","Gausiažiedės svidrės","Fair",1,{"$f":"HLOOKUP(Table2[[#This Row],[Catch crop]], Tool!C$29:M$29,1,0)","v":{"$error":"#N/A"}},null,{"$f":"100-Table2[[#This Row],[Achieved]]","v":100}]
["Tinkamumas trumpam laikotarpiui","Privalumai: poveikis dirvožemiui","Gausiažiedės svidrės","Excellent",4,{"$f":"HLOOKUP(Table2[[#This Row],[Catch crop]], Tool!C$29:M$29,1,0)","v":{"$error":"#N/A"}},null,{"$f":"100-Table2[[#This Row],[Achieved]]","v":100}]
["Perteklinio azoto sulaikymas","Veiksmingumas ir funkcijos","Daugiametės svidrės","Very good",3,{"$f":"HLOOKUP(Table2[[#This Row],[Catch crop]], Tool!C$29:M$29,1,0)","v":{"$error":"#N/A"}},null,{"$f":"100-Table2[[#This Row],[Achieved]]","v":100}]
["Organinės medžiagos kiekio didinimas","Veiksmingumas ir funkcijos","Daugiametės svidrės","Very good",3,{"$f":"HLOOKUP(Table2[[#This Row],[Catch crop]], Tool!C$29:M$29,1,0)","v":{"$error":"#N/A"}},null,{"$f":"100-Table2[[#This Row],[Achieved]]","v":100}]
["Erozijos mažinimas","Veiksmingumas ir funkcijos","Daugiametės svidrės","Very good",3,{"$f":"HLOOKUP(Table2[[#This Row],[Catch crop]], Tool!C$29:M$29,1,0)","v":{"$error":"#N/A"}},null,{"$f":"100-Table2[[#This Row],[Achieved]]","v":100}]
["Piktžolėtumo mažinimas","Veiksmingumas ir funkcijos","Daugiametės svidrės","Good",2,{"$f":"HLOOKUP(Table2[[#This Row],[Catch crop]], Tool!C$29:M$29,1,0)","v":{"$error":"#N/A"}},null,{"$f":"100-Table2[[#This Row],[Achieved]]","v":100}]
["Greitas augimas","Veiksmingumas ir funkcijos","Daugiametės svidrės","Very good",3,{"$f":"HLOOKUP(Table2[[#This Row],[Catch crop]], Tool!C$29:M$29,1,0)","v":{"$error":"#N/A"}},null,{"$f":"100-Table2[[#This Row],[Achieved]]","v":100}]
["Liekanų ilgaamžiškumas","Veiksmingumas ir funkcijos","Daugiametės svidrės","Very good",3,{"$f":"HLOOKUP(Table2[[#This Row],[Catch crop]], Tool!C$29:M$29,1,0)","v":{"$error":"#N/A"}},null,{"$f":"100-Table2[[#This Row],[Achieved]]","v":100}]
["Tinkamumas augti su pagrindiniu pasėliu","Veiksmingumas ir funkcijos","Daugiametės svidrės","Excellent",4,{"$f":"HLOOKUP(Table2[[#This Row],[Catch crop]], Tool!C$29:M$29,1,0)","v":{"$error":"#N/A"}},null,{"$f":"100-Table2[[#This Row],[Achieved]]","v":100}]
["Atsparumas šalčiui/ šalnoms","Atsparumas/ pakantumas","Daugiametės svidrės","Fair",1,{"$f":"HLOOKUP(Table2[[#This Row],[Catch crop]], Tool!C$29:M$29,1,0)","v":{"$error":"#N/A"}},null,{"$f":"100-Table2[[#This Row],[Achieved]]","v":100}]
["Pakantumas kaitrai","Atsparumas/ pakantumas","Daugiametės svidrės","Fair",1,{"$f":"HLOOKUP(Table2[[#This Row],[Catch crop]], Tool!C$29:M$29,1,0)","v":{"$error":"#N/A"}},null,{"$f":"100-Table2[[#This Row],[Achieved]]","v":100}]
["Pakantumas sausrai","Atsparumas/ pakantumas","Daugiametės svidrės","Fair",1,{"$f":"HLOOKUP(Table2[[#This Row],[Catch crop]], Tool!C$29:M$29,1,0)","v":{"$error":"#N/A"}},null,{"$f":"100-Table2[[#This Row],[Achieved]]","v":100}]
["Paunksmės toleravimas","Atsparumas/ pakantumas","Daugiametės svidrės","Very good",3,{"$f":"HLOOKUP(Table2[[#This Row],[Catch crop]], Tool!C$29:M$29,1,0)","v":{"$error":"#N/A"}},null,{"$f":"100-Table2[[#This Row],[Achieved]]","v":100}]
["Pakantumas užtvindymui","Atsparumas/ pakantumas","Daugiametės svidrės","Very good",3,{"$f":"HLOOKUP(Table2[[#This Row],[Catch crop]], Tool!C$29:M$29,1,0)","v":{"$error":"#N/A"}},null,{"$f":"100-Table2[[#This Row],[Achieved]]","v":100}]
["Pakantumas nederlingoms dirvoms","Atsparumas/ pakantumas","Daugiametės svidrės","Fair",1,{"$f":"HLOOKUP(Table2[[#This Row],[Catch crop]], Tool!C$29:M$29,1,0)","v":{"$error":"#N/A"}},null,{"$f":"100-Table2[[#This Row],[Achieved]]","v":100}]
["Podirvio purenimas","Privalumai: poveikis dirvožemiui","Daugiametės svidrės","Good",2,{"$f":"HLOOKUP(Table2[[#This Row],[Catch crop]], Tool!C$29:M$29,1,0)","v":{"$error":"#N/A"}},null,{"$f":"100-Table2[[#This Row],[Achieved]]","v":100}]
["Judriųjų P ir K gausinimas","Privalumai: poveikis dirvožemiui","Daugiametės svidrės","Good",2,{"$f":"HLOOKUP(Table2[[#This Row],[Catch crop]], Tool!C$29:M$29,1,0)","v":{"$error":"#N/A"}},null,{"$f":"100-Table2[[#This Row],[Achieved]]","v":100}]
["Armens purenimas","Privalumai: poveikis dirvožemiui","Daugiametės svidrės","Excellent",4,{"$f":"HLOOKUP(Table2[[#This Row],[Catch crop]], Tool!C$29:M$29,1,0)","v":{"$error":"#N/A"}},null,{"$f":"100-Table2[[#This Row],[Achieved]]","v":100}]
["Nematodų kontrolė","Privalumai: ligų ir piktžolių kontrolė","Daugiametės svidrės","Good",2,{"$f":"HLOOKUP(Table2[[#This Row],[Catch crop]], Tool!C$29:M$29,1,0)","v":{"$error":"#N/A"}},null,{"$f":"100-Table2[[#This Row],[Achieved]]","v":100}]
["Ligų kontrolė","Privalumai: ligų ir piktžolių kontrolė","Daugiametės svidrės","Good",2,{"$f":"HLOOKUP(Table2[[#This Row],[Catch crop]], Tool!C$29:M$29,1,0)","v":{"$error":"#N/A"}},null,{"$f":"100-Table2[[#This Row],[Achieved]]","v":100}]
["Alelopatinis poveikis","Privalumai: ligų ir piktžolių kontrolė","Daugiametės svidrės","Good",2,{"$f":"HLOOKUP(Table2[[#This Row],[Catch crop]], Tool!C$29:M$29,1,0)","v":{"$error":"#N/A"}},null,{"$f":"100-Table2[[#This Row],[Achieved]]","v":100}]
["Piktžolių stelbimas","Privalumai: ligų ir piktžolių kontrolė","Daugiametės svidrės","Excellent",4,{"$f":"HLOOKUP(Table2[[#This Row],[Catch crop]], Tool!C$29:M$29,1,0)","v":{"$error":"#N/A"}},null,{"$f":"100-Table2[[#This Row],[Achieved]]","v":100}]
["Naudingų vabzdžių pritraukimas","Privalumai: poveikis dirvožemiui","Daugiametės svidrės","Fair",1,{"$f":"HLOOKUP(Table2[[#This Row],[Catch crop]], Tool!C$29:M$29,1,0)","v":{"$error":"#N/A"}},null,{"$f":"100-Table2[[#This Row],[Achieved]]","v":100}]
["Tinkamumas trumpam laikotarpiui","Privalumai: poveikis dirvožemiui","Daugiametės svidrės","Excellent",4,{"$f":"HLOOKUP(Table2[[#This Row],[Catch crop]], Tool!C$29:M$29,1,0)","v":{"$error":"#N/A"}},null,{"$f":"100-Table2[[#This Row],[Achieved]]","v":100}]
["Perteklinio azoto sulaikymas","Veiksmingumas ir funkcijos","Facelijos","Excellent",4,{"$f":"HLOOKUP(Table2[[#This Row],[Catch crop]], Tool!C$29:M$29,1,0)","v":{"$error":"#N/A"}},null,{"$f":"100-Table2[[#This Row],[Achieved]]","v":100}]
["Organinės medžiagos kiekio didinimas","Veiksmingumas ir funkcijos","Facelijos","Very good",3,{"$f":"HLOOKUP(Table2[[#This Row],[Catch crop]], Tool!C$29:M$29,1,0)","v":{"$error":"#N/A"}},null,{"$f":"100-Table2[[#This Row],[Achieved]]","v":100}]
["Erozijos mažinimas","Veiksmingumas ir funkcijos","Facelijos","Very good",3,{"$f":"HLOOKUP(Table2[[#This Row],[Catch crop]], Tool!C$29:M$29,1,0)","v":{"$error":"#N/A"}},null,{"$f":"100-Table2[[#This Row],[Achieved]]","v":100}]
["Piktžolėtumo mažinimas","Veiksmingumas ir funkcijos","Facelijos","Good",2,{"$f":"HLOOKUP(Table2[[#This Row],[Catch crop]], Tool!C$29:M$29,1,0)","v":{"$error":"#N/A"}},null,{"$f":"100-Table2[[#This Row],[Achieved]]","v":100}]
["Greitas augimas","Veiksmingumas ir funkcijos","Facelijos","Very good",3,{"$f":"HLOOKUP(Table2[[#This Row],[Catch crop]], Tool!C$29:M$29,1,0)","v":{"$error":"#N/A"}},null,{"$f":"100-Table2[[#This Row],[Achieved]]","v":100}]
["Liekanų ilgaamžiškumas","Veiksmingumas ir funkcijos","Facelijos","Good",2,{"$f":"HLOOKUP(Table2[[#This Row],[Catch crop]], Tool!C$29:M$29,1,0)","v":{"$error":"#N/A"}},null,{"$f":"100-Table2[[#This Row],[Achieved]]","v":100}]
["Tinkamumas augti su pagrindiniu pasėliu","Veiksmingumas ir funkcijos","Facelijos","Excellent",4,{"$f":"HLOOKUP(Table2[[#This Row],[Catch crop]], Tool!C$29:M$29,1,0)","v":{"$error":"#N/A"}},null,{"$f":"100-Table2[[#This Row],[Achieved]]","v":100}]
["Atsparumas šalčiui/ šalnoms","Atsparumas/ pakantumas","Facelijos","Poor",0,{"$f":"HLOOKUP(Table2[[#This Row],[Catch crop]], Tool!C$29:M$29,1,0)","v":{"$error":"#N/A"}},null,{"$f":"100-Table2[[#This Row],[Achieved]]","v":100}]
["Pakantumas kaitrai","Atsparumas/ pakantumas","Facelijos","Good",2,{"$f":"HLOOKUP(Table2[[#This Row],[Catch crop]], Tool!C$29:M$29,1,0)","v":{"$error":"#N/A"}},null,{"$f":"100-Table2[[#This Row],[Achieved]]","v":100}]
["Pakantumas sausrai","Atsparumas/ pakantumas","Facelijos","Excellent",4,{"$f":"HLOOKUP(Table2[[#This Row],[Catch crop]], Tool!C$29:M$29,1,0)","v":{"$error":"#N/A"}},null,{"$f":"100-Table2[[#This Row],[Achieved]]","v":100}]
["Paunksmės toleravimas","Atsparumas/ pakantumas","Facelijos","Very good",3,{"$f":"HLOOKUP(Table2[[#This Row],[Catch crop]], Tool!C$29:M$29,1,0)","v":{"$error":"#N/A"}},null,{"$f":"100-Table2[[#This Row],[Achieved]]","v":100}]
["Pakantumas užtvindymui","Atsparumas/ pakantumas","Facelijos","Very good",3,{"$f":"HLOOKUP(Table2[[#This Row],[Catch crop]], Tool!C$29:M$29,1,0)","v":{"$error":"#N/A"}},null,{"$f":"100-Table2[[#This Row],[Achieved]]","v":100}]
["Pakantumas nederlingoms dirvoms","Atsparumas/ pakantumas","Facelijos","Excellent",4,{"$f":"HLOOKUP(Table2[[#This Row],[Catch crop]], Tool!C$29:M$29,1,0)","v":{"$error":"#N/A"}},null,{"$f":"100-Table2[[#This Row],[Achieved]]","v":100}]
["Podirvio purenimas","Privalumai: poveikis dirvožemiui","Facelijos","Fair",1,{"$f":"HLOOKUP(Table2[[#This Row],[Catch crop]], Tool!C$29:M$29,1,0)","v":{"$error":"#N/A"}},null,{"$f":"100-Table2[[#This Row],[Achieved]]","v":100}]
["Judriųjų P ir K gausinimas","Privalumai: poveikis dirvožemiui","Facelijos","Good",2,{"$f":"HLOOKUP(Table2[[#This Row],[Catch crop]], Tool!C$29:M$29,1,0)","v":{"$error":"#N/A"}},null,{"$f":"100-Table2[[#This Row],[Achieved]]","v":100}]
["Armens purenimas","Privalumai: poveikis dirvožemiui","Facelijos","Very good",3,{"$f":"HLOOKUP(Table2[[#This Row],[Catch crop]], Tool!C$29:M$29,1,0)","v":{"$error":"#N/A"}},null,{"$f":"100-Table2[[#This Row],[Achieved]]","v":100}]
["Nematodų kontrolė","Privalumai: ligų ir piktžolių kontrolė","Facelijos","Very good",3,{"$f":"HLOOKUP(Table2[[#This Row],[Catch crop]], Tool!C$29:M$29,1,0)","v":{"$error":"#N/A"}},null,{"$f":"100-Table2[[#This Row],[Achieved]]","v":100}]
["Ligų kontrolė","Privalumai: ligų ir piktžolių kontrolė","Facelijos","Very good",3,{"$f":"HLOOKUP(Table2[[#This Row],[Catch crop]], Tool!C$29:M$29,1,0)","v":{"$error":"#N/A"}},null,{"$f":"100-Table2[[#This Row],[Achieved]]","v":100}]
["Alelopatinis poveikis","Privalumai: ligų ir piktžolių kontrolė","Facelijos","Good",2,{"$f":"HLOOKUP(Table2[[#This Row],[Catch crop]], Tool!C$29:M$29,1,0)","v":{"$error":"#N/A"}},null,{"$f":"100-Table2[[#This Row],[Achieved]]","v":100}]
["Piktžolių stelbimas","Privalumai: ligų ir piktžolių kontrolė","Facelijos","Very good",3,{"$f":"HLOOKUP(Table2[[#This Row],[Catch crop]], Tool!C$29:M$29,1,0)","v":{"$error":"#N/A"}},null,{"$f":"100-Table2[[#This Row],[Achieved]]","v":100}]
["Naudingų vabzdžių pritraukimas","Privalumai: poveikis dirvožemiui","Facelijos","Excellent",4,{"$f":"HLOOKUP(Table2[[#This Row],[Catch crop]], Tool!C$29:M$29,1,0)","v":{"$error":"#N/A"}},null,{"$f":"100-Table2[[#This Row],[Achieved]]","v":100}]
["Tinkamumas trumpam laikotarpiui","Privalumai: poveikis dirvožemiui","Facelijos","Good",2,{"$f":"HLOOKUP(Table2[[#This Row],[Catch crop]], Tool!C$29:M$29,1,0)","v":{"$error":"#N/A"}},null,{"$f":"100-Table2[[#This Row],[Achieved]]","v":100}]
["Perteklinio azoto sulaikymas","Veiksmingumas ir funkcijos","Paprastosios šunažolės","Very good",3,{"$f":"HLOOKUP(Table2[[#This Row],[Catch crop]], Tool!C$29:M$29,1,0)","v":{"$error":"#N/A"}},null,{"$f":"100-Table2[[#This Row],[Achieved]]","v":100}]
["Organinės medžiagos kiekio didinimas","Veiksmingumas ir funkcijos","Paprastosios šunažolės","Very good",3,{"$f":"HLOOKUP(Table2[[#This Row],[Catch crop]], Tool!C$29:M$29,1,0)","v":{"$error":"#N/A"}},null,{"$f":"100-Table2[[#This Row],[Achieved]]","v":100}]
["Erozijos mažinimas","Veiksmingumas ir funkcijos","Paprastosios šunažolės",null,null,{"$f":"HLOOKUP(Table2[[#This Row],[Catch crop]], Tool!C$29:M$29,1,0)","v":{"$error":"#N/A"}},null,{"$f":"100-Table2[[#This Row],[Achieved]]","v":100}]
["Piktžolėtumo mažinimas","Veiksmingumas ir funkcijos","Paprastosios šunažolės","Good",2,{"$f":"HLOOKUP(Table2[[#This Row],[Catch crop]], Tool!C$29:M$29,1,0)","v":{"$error":"#N/A"}},null,{"$f":"100-Table2[[#This Row],[Achieved]]","v":100}]
["Greitas augimas","Veiksmingumas ir funkcijos","Paprastosios šunažolės",null,null,{"$f":"HLOOKUP(Table2[[#This Row],[Catch crop]], Tool!C$29:M$29,1,0)","v":{"$error":"#N/A"}},null,{"$f":"100-Table2[[#This Row],[Achieved]]","v":100}]
["Liekanų ilgaamžiškumas","Veiksmingumas ir funkcijos","Paprastosios šunažolės",null,null,{"$f":"HLOOKUP(Table2[[#This Row],[Catch crop]], Tool!C$29:M$29,1,0)","v":{"$error":"#N/A"}},null,{"$f":"100-Table2[[#This Row],[Achieved]]","v":100}]
["Tinkamumas augti su pagrindiniu pasėliu","Veiksmingumas ir funkcijos","Paprastosios šunažolės",null,null,{"$f":"HLOOKUP(Table2[[#This Row],[Catch crop]], Tool!C$29:M$29,1,0)","v":{"$error":"#N/A"}},null,{"$f":"100-Table2[[#This Row],[Achieved]]","v":100}]
["Atsparumas šalčiui/ šalnoms","Atsparumas/ pakantumas","Paprastosios šunažolės",null,null,{"$f":"HLOOKUP(Table2[[#This Row],[Catch crop]], Tool!C$29:M$29,1,0)","v":{"$error":"#N/A"}},null,{"$f":"100-Table2[[#This Row],[Achieved]]","v":100}]
["Pakantumas kaitrai","Atsparumas/ pakantumas","Paprastosios šunažolės",null,null,{"$f":"HLOOKUP(Table2[[#This Row],[Catch crop]], Tool!C$29:M$29,1,0)","v":{"$error":"#N/A"}},null,{"$f":"100-Table2[[#This Row],[Achieved]]","v":100}]
["Pakantumas sausrai","Atsparumas/ pakantumas","Paprastosios šunažolės",null,null,{"$f":"HLOOKUP(Table2[[#This Row],[Catch crop]], Tool!C$29:M$29,1,0)","v":{"$error":"#N/A"}},null,{"$f":"100-Table2[[#This Row],[Achieved]]","v":100}]
["Paunksmės toleravimas","Atsparumas/ pakantumas","Paprastosios šunažolės",null,null,{"$f":"HLOOKUP(Table2[[#This Row],[Catch crop]], Tool!C$29:M$29,1,0)","v":{"$error":"#N/A"}},null,{"$f":"100-Table2[[#This Row],[Achieved]]","v":100}]
["Pakantumas užtvindymui","Atsparumas/ pakantumas","Paprastosios šunažolės",null,null,{"$f":"HLOOKUP(Table2[[#This Row],[Catch crop]], Tool!C$29:M$29,1,0)","v":{"$error":"#N/A"}},null,{"$f":"100-Table2[[#This Row],[Achieved]]","v":100}]
["Pakantumas nederlingoms dirvoms","Atsparumas/ pakantumas","Paprastosios šunažolės",null,null,{"$f":"HLOOKUP(Table2[[#This Row],[Catch crop]], Tool!C$29:M$29,1,0)","v":{"$error":"#N/A"}},null,{"$f":"100-Table2[[#This Row],[Achieved]]","v":100}]
["Podirvio purenimas","Privalumai: poveikis dirvožemiui","Paprastosios šunažolės",null,null,{"$f":"HLOOKUP(Table2[[#This Row],[Catch crop]], Tool!C$29:M$29,1,0)","v":{"$error":"#N/A"}},null,{"$f":"100-Table2[[#This Row],[Achieved]]","v":100}]
["Judriųjų P ir K gausinimas","Privalumai: poveikis dirvožemiui","Paprastosios šunažolės",null,null,{"$f":"HLOOKUP(Table2[[#This Row],[Catch crop]], Tool!C$29:M$29,1,0)","v":{"$error":"#N/A"}},null,{"$f":"100-Table2[[#This Row],[Achieved]]","v":100}]
["Armens purenimas","Privalumai: poveikis dirvožemiui","Paprastosios šunažolės",null,null,{"$f":"HLOOKUP(Table2[[#This Row],[Catch crop]], Tool!C$29:M$29,1,0)","v":{"$error":"#N/A"}},null,{"$f":"100-Table2[[#This Row],[Achieved]]","v":100}]
["Nematodų kontrolė","Privalumai: ligų ir piktžolių kontrolė","Paprastosios šunažolės",null,null,{"$f":"HLOOKUP(Table2[[#This Row],[Catch crop]], Tool!C$29:M$29,1,0)","v":{"$error":"#N/A"}},null,{"$f":"100-Table2[[#This Row],[Achieved]]","v":100}]
["Ligų kontrolė","Privalumai: ligų ir piktžolių kontrolė","Paprastosios šunažolės",null,null,{"$f":"HLOOKUP(Table2[[#This Row],[Catch crop]], Tool!C$29:M$29,1,0)","v":{"$error":"#N/A"}},null,{"$f":"100-Table2[[#This Row],[Achieved]]","v":100}]
["Alelopatinis poveikis","Privalumai: ligų ir piktžolių kontrolė","Paprastosios šunažolės",null,null,{"$f":"HLOOKUP(Table2[[#This Row],[Catch crop]], Tool!C$29:M$29,1,0)","v":{"$error":"#N/A"}},null,{"$f":"100-Table2[[#This Row],[Achieved]]","v":100}]
["Piktžolių stelbimas","Privalumai: ligų ir piktžolių kontrolė","Paprastosios šunažolės",null,null,{"$f":"HLOOKUP(Table2[[#This Row],[Catch crop]], Tool!C$29:M$29,1,0)","v":{"$error":"#N/A"}},null,{"$f":"100-Table2[[#This Row],[Achieved]]","v":100}]
["Naudingų vabzdžių pritraukimas","Privalumai: poveikis dirvožemiui","Paprastosios šunažolės",null,null,{"$f":"HLOOKUP(Table2[[#This Row],[Catch crop]], Tool!C$29:M$29,1,0)","v":{"$error":"#N/A"}},null,{"$f":"100-Table2[[#This Row],[Achieved]]","v":100}]
["Tinkamumas trumpam laikotarpiui","Privalumai: poveikis dirvožemiui","Paprastosios šunažolės",null,null,{"$f":"HLOOKUP(Table2[[#This Row],[Catch crop]], Tool!C$29:M$29,1,0)","v":{"$error":"#N/A"}},null,{"$f":"100-Table2[[#This Row],[Achieved]]","v":100}]
["Perteklinio azoto sulaikymas","Veiksmingumas ir funkcijos","Sėjamosios ir netikšės avižos","Very good",3,{"$f":"HLOOKUP(Table2[[#This Row],[Catch crop]], Tool!C$29:M$29,1,0)","v":{"$error":"#N/A"}},null,{"$f":"100-Table2[[#This Row],[Achieved]]","v":100}]
["Organinės medžiagos kiekio didinimas","Veiksmingumas ir funkcijos","Sėjamosios ir netikšės avižos","Very good",3,{"$f":"HLOOKUP(Table2[[#This Row],[Catch crop]], Tool!C$29:M$29,1,0)","v":{"$error":"#N/A"}},null,{"$f":"100-Table2[[#This Row],[Achieved]]","v":100}]
["Erozijos mažinimas","Veiksmingumas ir funkcijos","Sėjamosios ir netikšės avižos","Very good",3,{"$f":"HLOOKUP(Table2[[#This Row],[Catch crop]], Tool!C$29:M$29,1,0)","v":{"$error":"#N/A"}},null,{"$f":"100-Table2[[#This Row],[Achieved]]","v":100}]
["Piktžolėtumo mažinimas","Veiksmingumas ir funkcijos","Sėjamosios ir netikšės avižos","Excellent",4,{"$f":"HLOOKUP(Table2[[#This Row],[Catch crop]], Tool!C$29:M$29,1,0)","v":{"$error":"#N/A"}},null,{"$f":"100-Table2[[#This Row],[Achieved]]","v":100}]
["Greitas augimas","Veiksmingumas ir funkcijos","Sėjamosios ir netikšės avižos","Excellent",4,{"$f":"HLOOKUP(Table2[[#This Row],[Catch crop]], Tool!C$29:M$29,1,0)","v":{"$error":"#N/A"}},null,{"$f":"100-Table2[[#This Row],[Achieved]]","v":100}]
["Liekanų ilgaamžiškumas","Veiksmingumas ir funkcijos","Sėjamosios ir netikšės avižos","Good",2,{"$f":"HLOOKUP(Table2[[#This Row],[Catch crop]], Tool!C$29:M$29,1,0)","v":{"$error":"#N/A"}},null,{"$f":"100-Table2[[#This Row],[Achieved]]","v":100}]
["Tinkamumas augti su pagrindiniu pasėliu","Veiksmingumas ir funkcijos","Sėjamosios ir netikšės avižos","Excellent",4,{"$f":"HLOOKUP(Table2[[#This Row],[Catch crop]], Tool!C$29:M$29,1,0)","v":{"$error":"#N/A"}},null,{"$f":"100-Table2[[#This Row],[Achieved]]","v":100}]
["Atsparumas šalčiui/ šalnoms","Atsparumas/ pakantumas","Sėjamosios ir netikšės avižos","Poor",0,{"$f":"HLOOKUP(Table2[[#This Row],[Catch crop]], Tool!C$29:M$29,1,0)","v":{"$error":"#N/A"}},null,{"$f":"100-Table2[[#This Row],[Achieved]]","v":100}]
["Pakantumas kaitrai","Atsparumas/ pakantumas","Sėjamosios ir netikšės avižos","Fair",1,{"$f":"HLOOKUP(Table2[[#This Row],[Catch crop]], Tool!C$29:M$29,1,0)","v":{"$error":"#N/A"}},null,{"$f":"100-Table2[[#This Row],[Achieved]]","v":100}]
["Pakantumas sausrai","Atsparumas/ pakantumas","Sėjamosios ir netikšės avižos","Fair",1,{"$f":"HLOOKUP(Table2[[#This Row],[Catch crop]], Tool!C$29:M$29,1,0)","v":{"$error":"#N/A"}},null,{"$f":"100-Table2[[#This Row],[Achieved]]","v":100}]
["Paunksmės toleravimas","Atsparumas/ pakantumas","Sėjamosios ir netikšės avižos","Fair",1,{"$f":"HLOOKUP(Table2[[#This Row],[Catch crop]], Tool!C$29:M$29,1,0)","v":{"$error":"#N/A"}},null,{"$f":"100-Table2[[#This Row],[Achieved]]","v":100}]
["Pakantumas užtvindymui","Atsparumas/ pakantumas","Sėjamosios ir netikšės avižos","Good",2,{"$f":"HLOOKUP(Table2[[#This Row],[Catch crop]], Tool!C$29:M$29,1,0)","v":{"$error":"#N/A"}},null,{"$f":"100-Table2[[#This Row],[Achieved]]","v":100}]
["Pakantumas nederlingoms dirvoms","Atsparumas/ pakantumas","Sėjamosios ir netikšės avižos","Good",2,{"$f":"HLOOKUP(Table2[[#This Row],[Catch crop]], Tool!C$29:M$29,1,0)","v":{"$error":"#N/A"}},null,{"$f":"100-Table2[[#This Row],[Achieved]]","v":100}]
["Podirvio purenimas","Privalumai: poveikis dirvožemiui","Sėjamosios ir netikšės avižos","Poor",0,{"$f":"HLOOKUP(Table2[[#This Row],[Catch crop]], Tool!C$29:M$29,1,0)","v":{"$error":"#N/A"}},null,{"$f":"100-Table2[[#This Row],[Achieved]]","v":100}]
["Judriųjų P ir K gausinimas","Privalumai: poveikis dirvožemiui","Sėjamosios ir netikšės avižos","Fair",1,{"$f":"HLOOKUP(Table2[[#This Row],[Catch crop]], Tool!C$29:M$29,1,0)","v":{"$error":"#N/A"}},null,{"$f":"100-Table2[[#This Row],[Achieved]]","v":100}]
["Armens purenimas","Privalumai: poveikis dirvožemiui","Sėjamosios ir netikšės avižos","Very good",3,{"$f":"HLOOKUP(Table2[[#This Row],[Catch crop]], Tool!C$29:M$29,1,0)","v":{"$error":"#N/A"}},null,{"$f":"100-Table2[[#This Row],[Achieved]]","v":100}]
["Nematodų kontrolė","Privalumai: ligų ir piktžolių kontrolė","Sėjamosios ir netikšės avižos","Poor",0,{"$f":"HLOOKUP(Table2[[#This Row],[Catch crop]], Tool!C$29:M$29,1,0)","v":{"$error":"#N/A"}},null,{"$f":"100-Table2[[#This Row],[Achieved]]","v":100}]
["Ligų kontrolė","Privalumai: ligų ir piktžolių kontrolė","Sėjamosios ir netikšės avižos","Good",2,{"$f":"HLOOKUP(Table2[[#This Row],[Catch crop]], Tool!C$29:M$29,1,0)","v":{"$error":"#N/A"}},null,{"$f":"100-Table2[[#This Row],[Achieved]]","v":100}]
["Alelopatinis poveikis","Privalumai: ligų ir piktžolių kontrolė","Sėjamosios ir netikšės avižos","Very good",3,{"$f":"HLOOKUP(Table2[[#This Row],[Catch crop]], Tool!C$29:M$29,1,0)","v":{"$error":"#N/A"}},null,{"$f":"100-Table2[[#This Row],[Achieved]]","v":100}]
["Piktžolių stelbimas","Privalumai: ligų ir piktžolių kontrolė","Sėjamosios ir netikšės avižos","Excellent",4,{"$f":"HLOOKUP(Table2[[#This Row],[Catch crop]], Tool!C$29:M$29,1,0)","v":{"$error":"#N/A"}},null,{"$f":"100-Table2[[#This Row],[Achieved]]","v":100}]
["Naudingų vabzdžių pritraukimas","Privalumai: poveikis dirvožemiui","Sėjamosios ir netikšės avižos","Poor",0,{"$f":"HLOOKUP(Table2[[#This Row],[Catch crop]], Tool!C$29:M$29,1,0)","v":{"$error":"#N/A"}},null,{"$f":"100-Table2[[#This Row],[Achieved]]","v":100}]
["Tinkamumas trumpam laikotarpiui","Privalumai: poveikis dirvožemiui","Sėjamosios ir netikšės avižos","Excellent",4,{"$f":"HLOOKUP(Table2[[#This Row],[Catch crop]], Tool!C$29:M$29,1,0)","v":{"$error":"#N/A"}},null,{"$f":"100-Table2[[#This Row],[Achieved]]","v":100}]
["Perteklinio azoto sulaikymas","Veiksmingumas ir funkcijos","Grikiai","Good",2,{"$f":"HLOOKUP(Table2[[#This Row],[Catch crop]], Tool!C$29:M$29,1,0)","v":{"$error":"#N/A"}},null,{"$f":"100-Table2[[#This Row],[Achieved]]","v":100}]
["Organinės medžiagos kiekio didinimas","Veiksmingumas ir funkcijos","Grikiai","Very good",3,{"$f":"HLOOKUP(Table2[[#This Row],[Catch crop]], Tool!C$29:M$29,1,0)","v":{"$error":"#N/A"}},null,{"$f":"100-Table2[[#This Row],[Achieved]]","v":100}]
["Erozijos mažinimas","Veiksmingumas ir funkcijos","Grikiai","Fair",1,{"$f":"HLOOKUP(Table2[[#This Row],[Catch crop]], Tool!C$29:M$29,1,0)","v":{"$error":"#N/A"}},null,{"$f":"100-Table2[[#This Row],[Achieved]]","v":100}]
["Piktžolėtumo mažinimas","Veiksmingumas ir funkcijos","Grikiai","Excellent",4,{"$f":"HLOOKUP(Table2[[#This Row],[Catch crop]], Tool!C$29:M$29,1,0)","v":{"$error":"#N/A"}},null,{"$f":"100-Table2[[#This Row],[Achieved]]","v":100}]
["Greitas augimas","Veiksmingumas ir funkcijos","Grikiai","Excellent",4,{"$f":"HLOOKUP(Table2[[#This Row],[Catch crop]], Tool!C$29:M$29,1,0)","v":{"$error":"#N/A"}},null,{"$f":"100-Table2[[#This Row],[Achieved]]","v":100}]
["Liekanų ilgaamžiškumas","Veiksmingumas ir funkcijos","Grikiai","Poor",0,{"$f":"HLOOKUP(Table2[[#This Row],[Catch crop]], Tool!C$29:M$29,1,0)","v":{"$error":"#N/A"}},null,{"$f":"100-Table2[[#This Row],[Achieved]]","v":100}]
["Tinkamumas augti su pagrindiniu pasėliu","Veiksmingumas ir funkcijos","Grikiai","Excellent",4,{"$f":"HLOOKUP(Table2[[#This Row],[Catch crop]], Tool!C$29:M$29,1,0)","v":{"$error":"#N/A"}},null,{"$f":"100-Table2[[#This Row],[Achieved]]","v":100}]
["Atsparumas šalčiui/ šalnoms","Atsparumas/ pakantumas","Grikiai","Fair",1,{"$f":"HLOOKUP(Table2[[#This Row],[Catch crop]], Tool!C$29:M$29,1,0)","v":{"$error":"#N/A"}},null,{"$f":"100-Table2[[#This Row],[Achieved]]","v":100}]
["Pakantumas kaitrai","Atsparumas/ pakantumas","Grikiai","Good",2,{"$f":"HLOOKUP(Table2[[#This Row],[Catch crop]], Tool!C$29:M$29,1,0)","v":{"$error":"#N/A"}},null,{"$f":"100-Table2[[#This Row],[Achieved]]","v":100}]
["Pakantumas sausrai","Atsparumas/ pakantumas","Grikiai","Poor",0,{"$f":"HLOOKUP(Table2[[#This Row],[Catch crop]], Tool!C$29:M$29,1,0)","v":{"$error":"#N/A"}},null,{"$f":"100-Table2[[#This Row],[Achieved]]","v":100}]
["Paunksmės toleravimas","Atsparumas/ pakantumas","Grikiai","Fair",1,{"$f":"HLOOKUP(Table2[[#This Row],[Catch crop]], Tool!C$29:M$29,1,0)","v":{"$error":"#N/A"}},null,{"$f":"100-Table2[[#This Row],[Achieved]]","v":100}]
["Pakantumas užtvindymui","Atsparumas/ pakantumas","Grikiai","Fair",1,{"$f":"HLOOKUP(Table2[[#This Row],[Catch crop]], Tool!C$29:M$29,1,0)","v":{"$error":"#N/A"}},null,{"$f":"100-Table2[[#This Row],[Achieved]]","v":100}]
["Pakantumas nederlingoms dirvoms","Atsparumas/ pakantumas","Grikiai","Fair",1,{"$f":"HLOOKUP(Table2[[#This Row],[Catch crop]], Tool!C$29:M$29,1,0)","v":{"$error":"#N/A"}},null,{"$f":"100-Table2[[#This Row],[Achieved]]","v":100}]
["Podirvio purenimas","Privalumai: poveikis dirvožemiui","Grikiai","Poor",0,{"$f":"HLOOKUP(Table2[[#This Row],[Catch crop]], Tool!C$29:M$29,1,0)","v":{"$error":"#N/A"}},null,{"$f":"100-Table2[[#This Row],[Achieved]]","v":100}]
["Judriųjų P ir K gausinimas","Privalumai: poveikis dirvožemiui","Grikiai","Excellent",4,{"$f":"HLOOKUP(Table2[[#This Row],[Catch crop]], Tool!C$29:M$29,1,0)","v":{"$error":"#N/A"}},null,{"$f":"100-Table2[[#This Row],[Achieved]]","v":100}]
["Armens purenimas","Privalumai: poveikis dirvožemiui","Grikiai","Very good",3,{"$f":"HLOOKUP(Table2[[#This Row],[Catch crop]], Tool!C$29:M$29,1,0)","v":{"$error":"#N/A"}},null,{"$f":"100-Table2[[#This Row],[Achieved]]","v":100}]
["Nematodų kontrolė","Privalumai: ligų ir piktžolių kontrolė","Grikiai","Fair",1,{"$f":"HLOOKUP(Table2[[#This Row],[Catch crop]], Tool!C$29:M$29,1,0)","v":{"$error":"#N/A"}},null,{"$f":"100-Table2[[#This Row],[Achieved]]","v":100}]
["Ligų kontrolė","Privalumai: ligų ir piktžolių kontrolė","Grikiai","Poor",0,{"$f":"HLOOKUP(Table2[[#This Row],[Catch crop]], Tool!C$29:M$29,1,0)","v":{"$error":"#N/A"}},null,{"$f":"100-Table2[[#This Row],[Achieved]]","v":100}]
["Alelopatinis poveikis","Privalumai: ligų ir piktžolių kontrolė","Grikiai","Very good",3,{"$f":"HLOOKUP(Table2[[#This Row],[Catch crop]], Tool!C$29:M$29,1,0)","v":{"$error":"#N/A"}},null,{"$f":"100-Table2[[#This Row],[Achieved]]","v":100}]
["Piktžolių stelbimas","Privalumai: ligų ir piktžolių kontrolė","Grikiai","Excellent",4,{"$f":"HLOOKUP(Table2[[#This Row],[Catch crop]], Tool!C$29:M$29,1,0)","v":{"$error":"#N/A"}},null,{"$f":"100-Table2[[#This Row],[Achieved]]","v":100}]
["Naudingų vabzdžių pritraukimas","Privalumai: poveikis dirvožemiui","Grikiai","Excellent",4,{"$f":"HLOOKUP(Table2[[#This Row],[Catch crop]], Tool!C$29:M$29,1,0)","v":{"$error":"#N/A"}},null,{"$f":"100-Table2[[#This Row],[Achieved]]","v":100}]
["Tinkamumas trumpam laikotarpiui","Privalumai: poveikis dirvožemiui","Grikiai","Excellent",4,{"$f":"HLOOKUP(Table2[[#This Row],[Catch crop]], Tool!C$29:M$29,1,0)","v":{"$error":"#N/A"}},null,{"$f":"100-Table2[[#This Row],[Achieved]]","v":100}]
["Perteklinio azoto sulaikymas","Veiksmingumas ir funkcijos","Žieminiai (ruginiai) vikiai","Fair",1,{"$f":"HLOOKUP(Table2[[#This Row],[Catch crop]], Tool!C$29:M$29,1,0)","v":{"$error":"#N/A"}},null,{"$f":"100-Table2[[#This Row],[Achieved]]","v":100}]
["Organinės medžiagos kiekio didinimas","Veiksmingumas ir funkcijos","Žieminiai (ruginiai) vikiai","Good",2,{"$f":"HLOOKUP(Table2[[#This Row],[Catch crop]], Tool!C$29:M$29,1,0)","v":{"$error":"#N/A"}},null,{"$f":"100-Table2[[#This Row],[Achieved]]","v":100}]
["Erozijos mažinimas","Veiksmingumas ir funkcijos","Žieminiai (ruginiai) vikiai","Good",2,{"$f":"HLOOKUP(Table2[[#This Row],[Catch crop]], Tool!C$29:M$29,1,0)","v":{"$error":"#N/A"}},null,{"$f":"100-Table2[[#This Row],[Achieved]]","v":100}]
["Piktžolėtumo mažinimas","Veiksmingumas ir funkcijos","Žieminiai (ruginiai) vikiai","Good",2,{"$f":"HLOOKUP(Table2[[#This Row],[Catch crop]], Tool!C$29:M$29,1,0)","v":{"$error":"#N/A"}},null,{"$f":"100-Table2[[#This Row],[Achieved]]","v":100}]
["Greitas augimas","Veiksmingumas ir funkcijos","Žieminiai (ruginiai) vikiai","Fair",1,{"$f":"HLOOKUP(Table2[[#This Row],[Catch crop]], Tool!C$29:M$29,1,0)","v":{"$error":"#N/A"}},null,{"$f":"100-Table2[[#This Row],[Achieved]]","v":100}]
["Liekanų ilgaamžiškumas","Veiksmingumas ir funkcijos","Žieminiai (ruginiai) vikiai","Fair",1,{"$f":"HLOOKUP(Table2[[#This Row],[Catch crop]], Tool!C$29:M$29,1,0)","v":{"$error":"#N/A"}},null,{"$f":"100-Table2[[#This Row],[Achieved]]","v":100}]
["Tinkamumas augti su pagrindiniu pasėliu","Veiksmingumas ir funkcijos","Žieminiai (ruginiai) vikiai","Good",2,{"$f":"HLOOKUP(Table2[[#This Row],[Catch crop]], Tool!C$29:M$29,1,0)","v":{"$error":"#N/A"}},null,{"$f":"100-Table2[[#This Row],[Achieved]]","v":100}]
["Atsparumas šalčiui/ šalnoms","Atsparumas/ pakantumas","Žieminiai (ruginiai) vikiai","Excellent",4,{"$f":"HLOOKUP(Table2[[#This Row],[Catch crop]], Tool!C$29:M$29,1,0)","v":{"$error":"#N/A"}},null,{"$f":"100-Table2[[#This Row],[Achieved]]","v":100}]
["Pakantumas kaitrai","Atsparumas/ pakantumas","Žieminiai (ruginiai) vikiai","Fair",1,{"$f":"HLOOKUP(Table2[[#This Row],[Catch crop]], Tool!C$29:M$29,1,0)","v":{"$error":"#N/A"}},null,{"$f":"100-Table2[[#This Row],[Achieved]]","v":100}]
["Pakantumas sausrai","Atsparumas/ pakantumas","Žieminiai (ruginiai) vikiai","Good",2,{"$f":"HLOOKUP(Table2[[#This Row],[Catch crop]], Tool!C$29:M$29,1,0)","v":{"$error":"#N/A"}},null,{"$f":"100-Table2[[#This Row],[Achieved]]","v":100}]
["Paunksmės toleravimas","Atsparumas/ pakantumas","Žieminiai (ruginiai) vikiai","Good",2,{"$f":"HLOOKUP(Table2[[#This Row],[Catch crop]], Tool!C$29:M$29,1,0)","v":{"$error":"#N/A"}},null,{"$f":"100-Table2[[#This Row],[Achieved]]","v":100}]
["Pakantumas užtvindymui","Atsparumas/ pakantumas","Žieminiai (ruginiai) vikiai","Fair",1,{"$f":"HLOOKUP(Table2[[#This Row],[Catch crop]], Tool!C$29:M$29,1,0)","v":{"$error":"#N/A"}},null,{"$f":"100-Table2[[#This Row],[Achieved]]","v":100}]
["Pakantumas nederlingoms dirvoms","Atsparumas/ pakantumas","Žieminiai (ruginiai) vikiai","Fair",1,{"$f":"HLOOKUP(Table2[[#This Row],[Catch crop]], Tool!C$29:M$29,1,0)","v":{"$error":"#N/A"}},null,{"$f":"100-Table2[[#This Row],[Achieved]]","v":100}]
["Podirvio purenimas","Privalumai: poveikis dirvožemiui","Žieminiai (ruginiai) vikiai","Good",2,{"$f":"HLOOKUP(Table2[[#This Row],[Catch crop]], Tool!C$29:M$29,1,0)","v":{"$error":"#N/A"}},null,{"$f":"100-Table2[[#This Row],[Achieved]]","v":100}]
["Judriųjų P ir K gausinimas","Privalumai: poveikis dirvožemiui","Žieminiai (ruginiai) vikiai","Good",2,{"$f":"HLOOKUP(Table2[[#This Row],[Catch crop]], Tool!C$29:M$29,1,0)","v":{"$error":"#N/A"}},null,{"$f":"100-Table2[[#This Row],[Achieved]]","v":100}]
["Armens purenimas","Privalumai: poveikis dirvožemiui","Žieminiai (ruginiai) vikiai","Very good",3,{"$f":"HLOOKUP(Table2[[#This Row],[Catch crop]], Tool!C$29:M$29,1,0)","v":{"$error":"#N/A"}},null,{"$f":"100-Table2[[#This Row],[Achieved]]","v":100}]
["Nematodų kontrolė","Privalumai: ligų ir piktžolių kontrolė","Žieminiai (ruginiai) vikiai","Fair",1,{"$f":"HLOOKUP(Table2[[#This Row],[Catch crop]], Tool!C$29:M$29,1,0)","v":{"$error":"#N/A"}},null,{"$f":"100-Table2[[#This Row],[Achieved]]","v":100}]
["Ligų kontrolė","Privalumai: ligų ir piktžolių kontrolė","Žieminiai (ruginiai) vikiai","Good",2,{"$f":"HLOOKUP(Table2[[#This Row],[Catch crop]], Tool!C$29:M$29,1,0)","v":{"$error":"#N/A"}},null,{"$f":"100-Table2[[#This Row],[Achieved]]","v":100}]
["Alelopatinis poveikis","Privalumai: ligų ir piktžolių kontrolė","Žieminiai (ruginiai) vikiai","Good",2,{"$f":"HLOOKUP(Table2[[#This Row],[Catch crop]], Tool!C$29:M$29,1,0)","v":{"$error":"#N/A"}},null,{"$f":"100-Table2[[#This Row],[Achieved]]","v":100}]
["Piktžolių stelbimas","Privalumai: ligų ir piktžolių kontrolė","Žieminiai (ruginiai) vikiai","Very good",3,{"$f":"HLOOKUP(Table2[[#This Row],[Catch crop]], Tool!C$29:M$29,1,0)","v":{"$error":"#N/A"}},null,{"$f":"100-Table2[[#This Row],[Achieved]]","v":100}]
["Naudingų vabzdžių pritraukimas","Privalumai: poveikis dirvožemiui","Žieminiai (ruginiai) vikiai","Excellent",4,{"$f":"HLOOKUP(Table2[[#This Row],[Catch crop]], Tool!C$29:M$29,1,0)","v":{"$error":"#N/A"}},null,{"$f":"100-Table2[[#This Row],[Achieved]]","v":100}]
["Tinkamumas trumpam laikotarpiui","Privalumai: poveikis dirvožemiui","Žieminiai (ruginiai) vikiai","Poor",0,{"$f":"HLOOKUP(Table2[[#This Row],[Catch crop]], Tool!C$29:M$29,1,0)","v":{"$error":"#N/A"}},null,{"$f":"100-Table2[[#This Row],[Achieved]]","v":100}]
["Perteklinio azoto sulaikymas","Veiksmingumas ir funkcijos","Sėjamieji žirniai","Fair",1,{"$f":"HLOOKUP(Table2[[#This Row],[Catch crop]], Tool!C$29:M$29,1,0)","v":{"$error":"#N/A"}},null,{"$f":"100-Table2[[#This Row],[Achieved]]","v":100}]
["Organinės medžiagos kiekio didinimas","Veiksmingumas ir funkcijos","Sėjamieji žirniai","Fair",1,{"$f":"HLOOKUP(Table2[[#This Row],[Catch crop]], Tool!C$29:M$29,1,0)","v":{"$error":"#N/A"}},null,{"$f":"100-Table2[[#This Row],[Achieved]]","v":100}]
["Erozijos mažinimas","Veiksmingumas ir funkcijos","Sėjamieji žirniai","Good",2,{"$f":"HLOOKUP(Table2[[#This Row],[Catch crop]], Tool!C$29:M$29,1,0)","v":{"$error":"#N/A"}},null,{"$f":"100-Table2[[#This Row],[Achieved]]","v":100}]
["Piktžolėtumo mažinimas","Veiksmingumas ir funkcijos","Sėjamieji žirniai","Good",2,{"$f":"HLOOKUP(Table2[[#This Row],[Catch crop]], Tool!C$29:M$29,1,0)","v":{"$error":"#N/A"}},null,{"$f":"100-Table2[[#This Row],[Achieved]]","v":100}]
["Greitas augimas","Veiksmingumas ir funkcijos","Sėjamieji žirniai","Very good",3,{"$f":"HLOOKUP(Table2[[#This Row],[Catch crop]], Tool!C$29:M$29,1,0)","v":{"$error":"#N/A"}},null,{"$f":"100-Table2[[#This Row],[Achieved]]","v":100}]
["Liekanų ilgaamžiškumas","Veiksmingumas ir funkcijos","Sėjamieji žirniai","Fair",1,{"$f":"HLOOKUP(Table2[[#This Row],[Catch crop]], Tool!C$29:M$29,1,0)","v":{"$error":"#N/A"}},null,{"$f":"100-Table2[[#This Row],[Achieved]]","v":100}]
["Tinkamumas augti su pagrindiniu pasėliu","Veiksmingumas ir funkcijos","Sėjamieji žirniai","Excellent",4,{"$f":"HLOOKUP(Table2[[#This Row],[Catch crop]], Tool!C$29:M$29,1,0)","v":{"$error":"#N/A"}},null,{"$f":"100-Table2[[#This Row],[Achieved]]","v":100}]
["Atsparumas šalčiui/ šalnoms","Atsparumas/ pakantumas","Sėjamieji žirniai","Poor",0,{"$f":"HLOOKUP(Table2[[#This Row],[Catch crop]], Tool!C$29:M$29,1,0)","v":{"$error":"#N/A"}},null,{"$f":"100-Table2[[#This Row],[Achieved]]","v":100}]
["Pakantumas kaitrai","Atsparumas/ pakantumas","Sėjamieji žirniai","Fair",1,{"$f":"HLOOKUP(Table2[[#This Row],[Catch crop]], Tool!C$29:M$29,1,0)","v":{"$error":"#N/A"}},null,{"$f":"100-Table2[[#This Row],[Achieved]]","v":100}]
["Pakantumas sausrai","Atsparumas/ pakantumas","Sėjamieji žirniai","Good",2,{"$f":"HLOOKUP(Table2[[#This Row],[Catch crop]], Tool!C$29:M$29,1,0)","v":{"$error":"#N/A"}},null,{"$f":"100-Table2[[#This Row],[Achieved]]","v":100}]
["Paunksmės toleravimas","Atsparumas/ pakantumas","Sėjamieji žirniai","Fair",1,{"$f":"HLOOKUP(Table2[[#This Row],[Catch crop]], Tool!C$29:M$29,1,0)","v":{"$error":"#N/A"}},null,{"$f":"100-Table2[[#This Row],[Achieved]]","v":100}]
["Pakantumas užtvindymui","Atsparumas/ pakantumas","Sėjamieji žirniai","Fair",1,{"$f":"HLOOKUP(Table2[[#This Row],[Catch crop]], Tool!C$29:M$29,1,0)","v":{"$error":"#N/A"}},null,{"$f":"100-Table2[[#This Row],[Achieved]]","v":100}]
["Pakantumas nederlingoms dirvoms","Atsparumas/ pakantumas","Sėjamieji žirniai","Fair",1,{"$f":"HLOOKUP(Table2[[#This Row],[Catch crop]], Tool!C$29:M$29,1,0)","v":{"$error":"#N/A"}},null,{"$f":"100-Table2[[#This Row],[Achieved]]","v":100}]
["Podirvio purenimas","Privalumai: poveikis dirvožemiui","Sėjamieji žirniai","Fair",1,{"$f":"HLOOKUP(Table2[[#This Row],[Catch crop]], Tool!C$29:M$29,1,0)","v":{"$error":"#N/A"}},null,{"$f":"100-Table2[[#This Row],[Achieved]]","v":100}]
["Judriųjų P ir K gausinimas","Privalumai: poveikis dirvožemiui","Sėjamieji žirniai","Fair",1,{"$f":"HLOOKUP(Table2[[#This Row],[Catch crop]], Tool!C$29:M$29,1,0)","v":{"$error":"#N/A"}},null,{"$f":"100-Table2[[#This Row],[Achieved]]","v":100}]
["Armens purenimas","Privalumai: poveikis dirvožemiui","Sėjamieji žirniai","Very good",3,{"$f":"HLOOKUP(Table2[[#This Row],[Catch crop]], Tool!C$29:M$29,1,0)","v":{"$error":"#N/A"}},null,{"$f":"100-Table2[[#This Row],[Achieved]]","v":100}]
["Nematodų kontrolė","Privalumai: ligų ir piktžolių kontrolė","Sėjamieji žirniai","Good",2,{"$f":"HLOOKUP(Table2[[#This Row],[Catch crop]], Tool!C$29:M$29,1,0)","v":{"$error":"#N/A"}},null,{"$f":"100-Table2[[#This Row],[Achieved]]","v":100}]
["Ligų kontrolė","Privalumai: ligų ir piktžolių kontrolė","Sėjamieji žirniai","Very good",3,{"$f":"HLOOKUP(Table2[[#This Row],[Catch crop]], Tool!C$29:M$29,1,0)","v":{"$error":"#N/A"}},null,{"$f":"100-Table2[[#This Row],[Achieved]]","v":100}]
["Alelopatinis poveikis","Privalumai: ligų ir piktžolių kontrolė","Sėjamieji žirniai","Fair",1,{"$f":"HLOOKUP(Table2[[#This Row],[Catch crop]], Tool!C$29:M$29,1,0)","v":{"$error":"#N/A"}},null,{"$f":"100-Table2[[#This Row],[Achieved]]","v":100}]
["Piktžolių stelbimas","Privalumai: ligų ir piktžolių kontrolė","Sėjamieji žirniai","Very good",3,{"$f":"HLOOKUP(Table2[[#This Row],[Catch crop]], Tool!C$29:M$29,1,0)","v":{"$error":"#N/A"}},null,{"$f":"100-Table2[[#This Row],[Achieved]]","v":100}]
["Naudingų vabzdžių pritraukimas","Privalumai: poveikis dirvožemiui","Sėjamieji žirniai","Very good",3,{"$f":"HLOOKUP(Table2[[#This Row],[Catch crop]], Tool!C$29:M$29,1,0)","v":{"$error":"#N/A"}},null,{"$f":"100-Table2[[#This Row],[Achieved]]","v":100}]
["Tinkamumas trumpam laikotarpiui","Privalumai: poveikis dirvožemiui","Sėjamieji žirniai","Very good",3,{"$f":"HLOOKUP(Table2[[#This Row],[Catch crop]], Tool!C$29:M$29,1,0)","v":{"$error":"#N/A"}},null,{"$f":"100-Table2[[#This Row],[Achieved]]","v":100}]
["Perteklinio azoto sulaikymas","Veiksmingumas ir funkcijos","Siauralapiai lubinai","Fair",1,{"$f":"HLOOKUP(Table2[[#This Row],[Catch crop]], Tool!C$29:M$29,1,0)","v":{"$error":"#N/A"}},null,{"$f":"100-Table2[[#This Row],[Achieved]]","v":100}]
["Organinės medžiagos kiekio didinimas","Veiksmingumas ir funkcijos","Siauralapiai lubinai","Good",2,{"$f":"HLOOKUP(Table2[[#This Row],[Catch crop]], Tool!C$29:M$29,1,0)","v":{"$error":"#N/A"}},null,{"$f":"100-Table2[[#This Row],[Achieved]]","v":100}]
["Erozijos mažinimas","Veiksmingumas ir funkcijos","Siauralapiai lubinai","Good",2,{"$f":"HLOOKUP(Table2[[#This Row],[Catch crop]], Tool!C$29:M$29,1,0)","v":{"$error":"#N/A"}},null,{"$f":"100-Table2[[#This Row],[Achieved]]","v":100}]
["Piktžolėtumo mažinimas","Veiksmingumas ir funkcijos","Siauralapiai lubinai","Good",2,{"$f":"HLOOKUP(Table2[[#This Row],[Catch crop]], Tool!C$29:M$29,1,0)","v":{"$error":"#N/A"}},null,{"$f":"100-Table2[[#This Row],[Achieved]]","v":100}]
["Greitas augimas","Veiksmingumas ir funkcijos","Siauralapiai lubinai","Fair",1,{"$f":"HLOOKUP(Table2[[#This Row],[Catch crop]], Tool!C$29:M$29,1,0)","v":{"$error":"#N/A"}},null,{"$f":"100-Table2[[#This Row],[Achieved]]","v":100}]
["Liekanų ilgaamžiškumas","Veiksmingumas ir funkcijos","Siauralapiai lubinai","Fair",1,{"$f":"HLOOKUP(Table2[[#This Row],[Catch crop]], Tool!C$29:M$29,1,0)","v":{"$error":"#N/A"}},null,{"$f":"100-Table2[[#This Row],[Achieved]]","v":100}]
["Tinkamumas augti su pagrindiniu pasėliu","Veiksmingumas ir funkcijos","Siauralapiai lubinai","Good",2,{"$f":"HLOOKUP(Table2[[#This Row],[Catch crop]], Tool!C$29:M$29,1,0)","v":{"$error":"#N/A"}},null,{"$f":"100-Table2[[#This Row],[Achieved]]","v":100}]
["Atsparumas šalčiui/ šalnoms","Atsparumas/ pakantumas","Siauralapiai lubinai","Fair",1,{"$f":"HLOOKUP(Table2[[#This Row],[Catch crop]], Tool!C$29:M$29,1,0)","v":{"$error":"#N/A"}},null,{"$f":"100-Table2[[#This Row],[Achieved]]","v":100}]
["Pakantumas kaitrai","Atsparumas/ pakantumas","Siauralapiai lubinai","Fair",1,{"$f":"HLOOKUP(Table2[[#This Row],[Catch crop]], Tool!C$29:M$29,1,0)","v":{"$error":"#N/A"}},null,{"$f":"100-Table2[[#This Row],[Achieved]]","v":100}]
["Pakantumas sausrai","Atsparumas/ pakantumas","Siauralapiai lubinai","Good",2,{"$f":"HLOOKUP(Table2[[#This Row],[Catch crop]], Tool!C$29:M$29,1,0)","v":{"$error":"#N/A"}},null,{"$f":"100-Table2[[#This Row],[Achieved]]","v":100}]
["Paunksmės toleravimas","Atsparumas/ pakantumas","Siauralapiai lubinai","Good",2,{"$f":"HLOOKUP(Table2[[#This Row],[Catch crop]], Tool!C$29:M$29,1,0)","v":{"$error":"#N/A"}},null,{"$f":"100-Table2[[#This Row],[Achieved]]","v":100}]
["Pakantumas užtvindymui","Atsparumas/ pakantumas","Siauralapiai lubinai","Fair",1,{"$f":"HLOOKUP(Table2[[#This Row],[Catch crop]], Tool!C$29:M$29,1,0)","v":{"$error":"#N/A"}},null,{"$f":"100-Table2[[#This Row],[Achieved]]","v":100}]
["Pakantumas nederlingoms dirvoms","Atsparumas/ pakantumas","Siauralapiai lubinai","Fair",1,{"$f":"HLOOKUP(Table2[[#This Row],[Catch crop]], Tool!C$29:M$29,1,0)","v":{"$error":"#N/A"}},null,{"$f":"100-Table2[[#This Row],[Achieved]]","v":100}]
["Podirvio purenimas","Privalumai: poveikis dirvožemiui","Siauralapiai lubinai","Good",2,{"$f":"HLOOKUP(Table2[[#This Row],[Catch crop]], Tool!C$29:M$29,1,0)","v":{"$error":"#N/A"}},null,{"$f":"100-Table2[[#This Row],[Achieved]]","v":100}]
["Judriųjų P ir K gausinimas","Privalumai: poveikis dirvožemiui","Siauralapiai lubinai","Good",2,{"$f":"HLOOKUP(Table2[[#This Row],[Catch crop]], Tool!C$29:M$29,1,0)","v":{"$error":"#N/A"}},null,{"$f":"100-Table2[[#This Row],[Achieved]]","v":100}]
["Armens purenimas","Privalumai: poveikis dirvožemiui","Siauralapiai lubinai","Very good",3,{"$f":"HLOOKUP(Table2[[#This Row],[Catch crop]], Tool!C$29:M$29,1,0)","v":{"$error":"#N/A"}},null,{"$f":"100-Table2[[#This Row],[Achieved]]","v":100}]
["Nematodų kontrolė","Privalumai: ligų ir piktžolių kontrolė","Siauralapiai lubinai","Fair",1,{"$f":"HLOOKUP(Table2[[#This Row],[Catch crop]], Tool!C$29:M$29,1,0)","v":{"$error":"#N/A"}},null,{"$f":"100-Table2[[#This Row],[Achieved]]","v":100}]
["Ligų kontrolė","Privalumai: ligų ir piktžolių kontrolė","Siauralapiai lubinai","Good",2,{"$f":"HLOOKUP(Table2[[#This Row],[Catch crop]], Tool!C$29:M$29,1,0)","v":{"$error":"#N/A"}},null,{"$f":"100-Table2[[#This Row],[Achieved]]","v":100}]
["Alelopatinis poveikis","Privalumai: ligų ir piktžolių kontrolė","Siauralapiai lubinai","Good",2,{"$f":"HLOOKUP(Table2[[#This Row],[Catch crop]], Tool!C$29:M$29,1,0)","v":{"$error":"#N/A"}},null,{"$f":"100-Table2[[#This Row],[Achieved]]","v":100}]
["Piktžolių stelbimas","Privalumai: ligų ir piktžolių kontrolė","Siauralapiai lubinai","Fair",1,{"$f":"HLOOKUP(Table2[[#This Row],[Catch crop]], Tool!C$29:M$29,1,0)","v":{"$error":"#N/A"}},null,{"$f":"100-Table2[[#This Row],[Achieved]]","v":100}]
["Naudingų vabzdžių pritraukimas","Privalumai: poveikis dirvožemiui","Siauralapiai lubinai","Excellent",4,{"$f":"HLOOKUP(Table2[[#This Row],[Catch crop]], Tool!C$29:M$29,1,0)","v":{"$error":"#N/A"}},null,{"$f":"100-Table2[[#This Row],[Achieved]]","v":100}]
["Tinkamumas trumpam laikotarpiui","Privalumai: poveikis dirvožemiui","Siauralapiai lubinai","Poor",0,{"$f":"HLOOKUP(Table2[[#This Row],[Catch crop]], Tool!C$29:M$29,1,0)","v":{"$error":"#N/A"}},null,{"$f":"100-Table2[[#This Row],[Achieved]]","v":100}]
["Perteklinio azoto sulaikymas","Veiksmingumas ir funkcijos","Pupos","Fair",1,{"$f":"HLOOKUP(Table2[[#This Row],[Catch crop]], Tool!C$29:M$29,1,0)","v":{"$error":"#N/A"}},null,{"$f":"100-Table2[[#This Row],[Achieved]]","v":100}]
["Organinės medžiagos kiekio didinimas","Veiksmingumas ir funkcijos","Pupos","Fair",1,{"$f":"HLOOKUP(Table2[[#This Row],[Catch crop]], Tool!C$29:M$29,1,0)","v":{"$error":"#N/A"}},null,{"$f":"100-Table2[[#This Row],[Achieved]]","v":100}]
["Erozijos mažinimas","Veiksmingumas ir funkcijos","Pupos","Good",2,{"$f":"HLOOKUP(Table2[[#This Row],[Catch crop]], Tool!C$29:M$29,1,0)","v":{"$error":"#N/A"}},null,{"$f":"100-Table2[[#This Row],[Achieved]]","v":100}]
["Piktžolėtumo mažinimas","Veiksmingumas ir funkcijos","Pupos","Good",2,{"$f":"HLOOKUP(Table2[[#This Row],[Catch crop]], Tool!C$29:M$29,1,0)","v":{"$error":"#N/A"}},null,{"$f":"100-Table2[[#This Row],[Achieved]]","v":100}]
["Greitas augimas","Veiksmingumas ir funkcijos","Pupos","Very good",3,{"$f":"HLOOKUP(Table2[[#This Row],[Catch crop]], Tool!C$29:M$29,1,0)","v":{"$error":"#N/A"}},null,{"$f":"100-Table2[[#This Row],[Achieved]]","v":100}]
["Liekanų ilgaamžiškumas","Veiksmingumas ir funkcijos","Pupos","Fair",1,{"$f":"HLOOKUP(Table2[[#This Row],[Catch crop]], Tool!C$29:M$29,1,0)","v":{"$error":"#N/A"}},null,{"$f":"100-Table2[[#This Row],[Achieved]]","v":100}]
["Tinkamumas augti su pagrindiniu pasėliu","Veiksmingumas ir funkcijos","Pupos","Excellent",4,{"$f":"HLOOKUP(Table2[[#This Row],[Catch crop]], Tool!C$29:M$29,1,0)","v":{"$error":"#N/A"}},null,{"$f":"100-Table2[[#This Row],[Achieved]]","v":100}]
["Atsparumas šalčiui/ šalnoms","Atsparumas/ pakantumas","Pupos","Fair",1,{"$f":"HLOOKUP(Table2[[#This Row],[Catch crop]], Tool!C$29:M$29,1,0)","v":{"$error":"#N/A"}},null,{"$f":"100-Table2[[#This Row],[Achieved]]","v":100}]
["Pakantumas kaitrai","Atsparumas/ pakantumas","Pupos","Fair",1,{"$f":"HLOOKUP(Table2[[#This Row],[Catch crop]], Tool!C$29:M$29,1,0)","v":{"$error":"#N/A"}},null,{"$f":"100-Table2[[#This Row],[Achieved]]","v":100}]
["Pakantumas sausrai","Atsparumas/ pakantumas","Pupos","Fair",1,{"$f":"HLOOKUP(Table2[[#This Row],[Catch crop]], Tool!C$29:M$29,1,0)","v":{"$error":"#N/A"}},null,{"$f":"100-Table2[[#This Row],[Achieved]]","v":100}]
["Paunksmės toleravimas","Atsparumas/ pakantumas","Pupos","Good",2,{"$f":"HLOOKUP(Table2[[#This Row],[Catch crop]], Tool!C$29:M$29,1,0)","v":{"$error":"#N/A"}},null,{"$f":"100-Table2[[#This Row],[Achieved]]","v":100}]
["Pakantumas užtvindymui","Atsparumas/ pakantumas","Pupos","Very good",3,{"$f":"HLOOKUP(Table2[[#This Row],[Catch crop]], Tool!C$29:M$29,1,0)","v":{"$error":"#N/A"}},null,{"$f":"100-Table2[[#This Row],[Achieved]]","v":100}]
["Pakantumas nederlingoms dirvoms","Atsparumas/ pakantumas","Pupos","Fair",1,{"$f":"HLOOKUP(Table2[[#This Row],[Catch crop]], Tool!C$29:M$29,1,0)","v":{"$error":"#N/A"}},null,{"$f":"100-Table2[[#This Row],[Achieved]]","v":100}]
["Podirvio purenimas","Privalumai: poveikis dirvožemiui","Pupos","Very good",3,{"$f":"HLOOKUP(Table2[[#This Row],[Catch crop]], Tool!C$29:M$29,1,0)","v":{"$error":"#N/A"}},null,{"$f":"100-Table2[[#This Row],[Achieved]]","v":100}]
["Judriųjų P ir K gausinimas","Privalumai: poveikis dirvožemiui","Pupos","Fair",1,{"$f":"HLOOKUP(Table2[[#This Row],[Catch crop]], Tool!C$29:M$29,1,0)","v":{"$error":"#N/A"}},null,{"$f":"100-Table2[[#This Row],[Achieved]]","v":100}]
["Armens purenimas","Privalumai: poveikis dirvožemiui","Pupos","Very good",3,{"$f":"HLOOKUP(Table2[[#This Row],[Catch crop]], Tool!C$29:M$29,1,0)","v":{"$error":"#N/A"}},null,{"$f":"100-Table2[[#This Row],[Achieved]]","v":100}]
["Nematodų kontrolė","Privalumai: ligų ir piktžolių kontrolė","Pupos","Very good",3,{"$f":"HLOOKUP(Table2[[#This Row],[Catch crop]], Tool!C$29:M$29,1,0)","v":{"$error":"#N/A"}},null,{"$f":"100-Table2[[#This Row],[Achieved]]","v":100}]
["Ligų kontrolė","Privalumai: ligų ir piktžolių kontrolė","Pupos","Very good",3,{"$f":"HLOOKUP(Table2[[#This Row],[Catch crop]], Tool!C$29:M$29,1,0)","v":{"$error":"#N/A"}},null,{"$f":"100-Table2[[#This Row],[Achieved]]","v":100}]
["Alelopatinis poveikis","Privalumai: ligų ir piktžolių kontrolė","Pupos","Fair",1,{"$f":"HLOOKUP(Table2[[#This Row],[Catch crop]], Tool!C$29:M$29,1,0)","v":{"$error":"#N/A"}},null,{"$f":"100-Table2[[#This Row],[Achieved]]","v":100}]
["Piktžolių stelbimas","Privalumai: ligų ir piktžolių kontrolė","Pupos","Very good",3,{"$f":"HLOOKUP(Table2[[#This Row],[Catch crop]], Tool!C$29:M$29,1,0)","v":{"$error":"#N/A"}},null,{"$f":"100-Table2[[#This Row],[Achieved]]","v":100}]
["Naudingų vabzdžių pritraukimas","Privalumai: poveikis dirvožemiui","Pupos","Very good",3,{"$f":"HLOOKUP(Table2[[#This Row],[Catch crop]], Tool!C$29:M$29,1,0)","v":{"$error":"#N/A"}},null,{"$f":"100-Table2[[#This Row],[Achieved]]","v":100}]
["Tinkamumas trumpam laikotarpiui","Privalumai: poveikis dirvožemiui","Pupos","Very good",3,{"$f":"HLOOKUP(Table2[[#This Row],[Catch crop]], Tool!C$29:M$29,1,0)","v":{"$error":"#N/A"}},null,{"$f":"100-Table2[[#This Row],[Achieved]]","v":100}]
["Piktžolėtumo pavojus","Trūkumai: žaladarių pavojus","Baltosios garstyčios","Could be a moderate problem",1,{"$f":"HLOOKUP(Table2[[#This Row],[Catch crop]], Tool!C$29:M$29,1,0)","v":"Baltosios garstyčios"},null,{"$f":"100-Table2[[#This Row],[Achieved]]","v":100}]
["Kenkėjų/ nematodų platinimas","Trūkumai: žaladarių pavojus","Baltosios garstyčios","Occasionally a minor problem",3,{"$f":"HLOOKUP(Table2[[#This Row],[Catch crop]], Tool!C$29:M$29,1,0)","v":"Baltosios garstyčios"},null,{"$f":"100-Table2[[#This Row],[Achieved]]","v":100}]
["Augalų ligų platinimas","Trūkumai: žaladarių pavojus","Baltosios garstyčios","Not a problem",4,{"$f":"HLOOKUP(Table2[[#This Row],[Catch crop]], Tool!C$29:M$29,1,0)","v":"Baltosios garstyčios"},null,{"$f":"100-Table2[[#This Row],[Achieved]]","v":100}]
["Piktžolėtumo pavojus","Trūkumai: žaladarių pavojus","Rudosios garstyčios","Could be a moderate problem",1,{"$f":"HLOOKUP(Table2[[#This Row],[Catch crop]], Tool!C$29:M$29,1,0)","v":{"$error":"#N/A"}},null,{"$f":"100-Table2[[#This Row],[Achieved]]","v":100}]
["Kenkėjų/ nematodų platinimas","Trūkumai: žaladarių pavojus","Rudosios garstyčios","Occasionally a minor problem",3,{"$f":"HLOOKUP(Table2[[#This Row],[Catch crop]], Tool!C$29:M$29,1,0)","v":{"$error":"#N/A"}},null,{"$f":"100-Table2[[#This Row],[Achieved]]","v":100}]
["Augalų ligų platinimas","Trūkumai: žaladarių pavojus","Rudosios garstyčios","Not a problem",4,{"$f":"HLOOKUP(Table2[[#This Row],[Catch crop]], Tool!C$29:M$29,1,0)","v":{"$error":"#N/A"}},null,{"$f":"100-Table2[[#This Row],[Achieved]]","v":100}]
["Piktžolėtumo pavojus","Trūkumai: žaladarių pavojus","Vasariniai rapsai","Could be a moderate problem",1,{"$f":"HLOOKUP(Table2[[#This Row],[Catch crop]], Tool!C$29:M$29,1,0)","v":"Vasariniai rapsai"},null,{"$f":"100-Table2[[#This Row],[Achieved]]","v":100}]
["Kenkėjų/ nematodų platinimas","Trūkumai: žaladarių pavojus","Vasariniai rapsai","Could be a moderate problem",1,{"$f":"HLOOKUP(Table2[[#This Row],[Catch crop]], Tool!C$29:M$29,1,0)","v":"Vasariniai rapsai"},null,{"$f":"100-Table2[[#This Row],[Achieved]]","v":100}]
["Augalų ligų platinimas","Trūkumai: žaladarių pavojus","Vasariniai rapsai","Not a problem",4,{"$f":"HLOOKUP(Table2[[#This Row],[Catch crop]], Tool!C$29:M$29,1,0)","v":"Vasariniai rapsai"},null,{"$f":"100-Table2[[#This Row],[Achieved]]","v":100}]
["Piktžolėtumo pavojus","Trūkumai: žaladarių pavojus","Žieminiai rapsai","Could be a moderate problem",1,{"$f":"HLOOKUP(Table2[[#This Row],[Catch crop]], Tool!C$29:M$29,1,0)","v":"Žieminiai rapsai"},null,{"$f":"100-Table2[[#This Row],[Achieved]]","v":100}]
["Kenkėjų/ nematodų platinimas","Trūkumai: žaladarių pavojus","Žieminiai rapsai","Could be a moderate problem",1,{"$f":"HLOOKUP(Table2[[#This Row],[Catch crop]], Tool!C$29:M$29,1,0)","v":"Žieminiai rapsai"},null,{"$f":"100-Table2[[#This Row],[Achieved]]","v":100}]
["Augalų ligų platinimas","Trūkumai: žaladarių pavojus","Žieminiai rapsai","Not a problem",4,{"$f":"HLOOKUP(Table2[[#This Row],[Catch crop]], Tool!C$29:M$29,1,0)","v":"Žieminiai rapsai"},null,{"$f":"100-Table2[[#This Row],[Achieved]]","v":100}]
["Piktžolėtumo pavojus","Trūkumai: žaladarių pavojus","Aliejiniai ridikai","Could be a minor problem",2,{"$f":"HLOOKUP(Table2[[#This Row],[Catch crop]], Tool!C$29:M$29,1,0)","v":"Aliejiniai ridikai"},null,{"$f":"100-Table2[[#This Row],[Achieved]]","v":100}]
["Kenkėjų/ nematodų platinimas","Trūkumai: žaladarių pavojus","Aliejiniai ridikai","Occasionally a minor problem",3,{"$f":"HLOOKUP(Table2[[#This Row],[Catch crop]], Tool!C$29:M$29,1,0)","v":"Aliejiniai ridikai"},null,{"$f":"100-Table2[[#This Row],[Achieved]]","v":100}]
["Augalų ligų platinimas","Trūkumai: žaladarių pavojus","Aliejiniai ridikai","Not a problem",4,{"$f":"HLOOKUP(Table2[[#This Row],[Catch crop]], Tool!C$29:M$29,1,0)","v":"Aliejiniai ridikai"},null,{"$f":"100-Table2[[#This Row],[Achieved]]","v":100}]
["Piktžolėtumo pavojus","Trūkumai: žaladarių pavojus","Šakniniai ridikai","Could be a minor problem",2,{"$f":"HLOOKUP(Table2[[#This Row],[Catch crop]], Tool!C$29:M$29,1,0)","v":{"$error":"#N/A"}},null,{"$f":"100-Table2[[#This Row],[Achieved]]","v":100}]
["Kenkėjų/ nematodų platinimas","Trūkumai: žaladarių pavojus","Šakniniai ridikai","Occasionally a minor problem",3,{"$f":"HLOOKUP(Table2[[#This Row],[Catch crop]], Tool!C$29:M$29,1,0)","v":{"$error":"#N/A"}},null,{"$f":"100-Table2[[#This Row],[Achieved]]","v":100}]
["Augalų ligų platinimas","Trūkumai: žaladarių pavojus","Šakniniai ridikai","Not a problem",4,{"$f":"HLOOKUP(Table2[[#This Row],[Catch crop]], Tool!C$29:M$29,1,0)","v":{"$error":"#N/A"}},null,{"$f":"100-Table2[[#This Row],[Achieved]]","v":100}]
["Piktžolėtumo pavojus","Trūkumai: žaladarių pavojus","Žieminiai rapsiukai","Could be a minor problem",2,{"$f":"HLOOKUP(Table2[[#This Row],[Catch crop]], Tool!C$29:M$29,1,0)","v":"Žieminiai rapsiukai"},null,{"$f":"100-Table2[[#This Row],[Achieved]]","v":100}]
["Kenkėjų/ nematodų platinimas","Trūkumai: žaladarių pavojus","Žieminiai rapsiukai","Not a problem",4,{"$f":"HLOOKUP(Table2[[#This Row],[Catch crop]], Tool!C$29:M$29,1,0)","v":"Žieminiai rapsiukai"},null,{"$f":"100-Table2[[#This Row],[Achieved]]","v":100}]
["Augalų ligų platinimas","Trūkumai: žaladarių pavojus","Žieminiai rapsiukai","Not a problem",4,{"$f":"HLOOKUP(Table2[[#This Row],[Catch crop]], Tool!C$29:M$29,1,0)","v":"Žieminiai rapsiukai"},null,{"$f":"100-Table2[[#This Row],[Achieved]]","v":100}]
["Piktžolėtumo pavojus","Trūkumai: žaladarių pavojus","Žieminiai rugiai","Could be a moderate problem",1,{"$f":"HLOOKUP(Table2[[#This Row],[Catch crop]], Tool!C$29:M$29,1,0)","v":"Žieminiai rugiai"},null,{"$f":"100-Table2[[#This Row],[Achieved]]","v":100}]
["Kenkėjų/ nematodų platinimas","Trūkumai: žaladarių pavojus","Žieminiai rugiai","Could be a minor problem",2,{"$f":"HLOOKUP(Table2[[#This Row],[Catch crop]], Tool!C$29:M$29,1,0)","v":"Žieminiai rugiai"},null,{"$f":"100-Table2[[#This Row],[Achieved]]","v":100}]
["Augalų ligų platinimas","Trūkumai: žaladarių pavojus","Žieminiai rugiai","Occasionally a minor problem",3,{"$f":"HLOOKUP(Table2[[#This Row],[Catch crop]], Tool!C$29:M$29,1,0)","v":"Žieminiai rugiai"},null,{"$f":"100-Table2[[#This Row],[Achieved]]","v":100}]
["Piktžolėtumo pavojus","Trūkumai: žaladarių pavojus","Baltieji dobilai","Could be a minor problem",2,{"$f":"HLOOKUP(Table2[[#This Row],[Catch crop]], Tool!C$29:M$29,1,0)","v":{"$error":"#N/A"}},null,{"$f":"100-Table2[[#This Row],[Achieved]]","v":100}]
["Kenkėjų/ nematodų platinimas","Trūkumai: žaladarių pavojus","Baltieji dobilai","Could be a minor problem",2,{"$f":"HLOOKUP(Table2[[#This Row],[Catch crop]], Tool!C$29:M$29,1,0)","v":{"$error":"#N/A"}},null,{"$f":"100-Table2[[#This Row],[Achieved]]","v":100}]
["Augalų ligų platinimas","Trūkumai: žaladarių pavojus","Baltieji dobilai","Occasionally a minor problem",3,{"$f":"HLOOKUP(Table2[[#This Row],[Catch crop]], Tool!C$29:M$29,1,0)","v":{"$error":"#N/A"}},null,{"$f":"100-Table2[[#This Row],[Achieved]]","v":100}]
["Piktžolėtumo pavojus","Trūkumai: žaladarių pavojus","Raudonieji dobilai","Could be a minor problem",2,{"$f":"HLOOKUP(Table2[[#This Row],[Catch crop]], Tool!C$29:M$29,1,0)","v":{"$error":"#N/A"}},null,{"$f":"100-Table2[[#This Row],[Achieved]]","v":100}]
["Kenkėjų/ nematodų platinimas","Trūkumai: žaladarių pavojus","Raudonieji dobilai","Could be a moderate problem",1,{"$f":"HLOOKUP(Table2[[#This Row],[Catch crop]], Tool!C$29:M$29,1,0)","v":{"$error":"#N/A"}},null,{"$f":"100-Table2[[#This Row],[Achieved]]","v":100}]
["Augalų ligų platinimas","Trūkumai: žaladarių pavojus","Raudonieji dobilai","Occasionally a minor problem",3,{"$f":"HLOOKUP(Table2[[#This Row],[Catch crop]], Tool!C$29:M$29,1,0)","v":{"$error":"#N/A"}},null,{"$f":"100-Table2[[#This Row],[Achieved]]","v":100}]
["Piktžolėtumo pavojus","Trūkumai: žaladarių pavojus","Baltažiedžiai barkūnai","Could be a moderate problem",1,{"$f":"HLOOKUP(Table2[[#This Row],[Catch crop]], Tool!C$29:M$29,1,0)","v":{"$error":"#N/A"}},null,{"$f":"100-Table2[[#This Row],[Achieved]]","v":100}]
["Kenkėjų/ nematodų platinimas","Trūkumai: žaladarių pavojus","Baltažiedžiai barkūnai","Could be a moderate problem",1,{"$f":"HLOOKUP(Table2[[#This Row],[Catch crop]], Tool!C$29:M$29,1,0)","v":{"$error":"#N/A"}},null,{"$f":"100-Table2[[#This Row],[Achieved]]","v":100}]
["Augalų ligų platinimas","Trūkumai: žaladarių pavojus","Baltažiedžiai barkūnai","Not a problem",4,{"$f":"HLOOKUP(Table2[[#This Row],[Catch crop]], Tool!C$29:M$29,1,0)","v":{"$error":"#N/A"}},null,{"$f":"100-Table2[[#This Row],[Achieved]]","v":100}]
["Piktžolėtumo pavojus","Trūkumai: žaladarių pavojus","Gausiažiedės svidrės","Problem",0,{"$f":"HLOOKUP(Table2[[#This Row],[Catch crop]], Tool!C$29:M$29,1,0)","v":{"$error":"#N/A"}},null,{"$f":"100-Table2[[#This Row],[Achieved]]","v":100}]
["Kenkėjų/ nematodų platinimas","Trūkumai: žaladarių pavojus","Gausiažiedės svidrės","Occasionally a minor problem",3,{"$f":"HLOOKUP(Table2[[#This Row],[Catch crop]], Tool!C$29:M$29,1,0)","v":{"$error":"#N/A"}},null,{"$f":"100-Table2[[#This Row],[Achieved]]","v":100}]
["Augalų ligų platinimas","Trūkumai: žaladarių pavojus","Gausiažiedės svidrės","Occasionally a minor problem",3,{"$f":"HLOOKUP(Table2[[#This Row],[Catch crop]], Tool!C$29:M$29,1,0)","v":{"$error":"#N/A"}},null,{"$f":"100-Table2[[#This Row],[Achieved]]","v":100}]
["Piktžolėtumo pavojus","Trūkumai: žaladarių pavojus","Daugiametės svidrės","Problem",0,{"$f":"HLOOKUP(Table2[[#This Row],[Catch crop]], Tool!C$29:M$29,1,0)","v":{"$error":"#N/A"}},null,{"$f":"100-Table2[[#This Row],[Achieved]]","v":100}]
["Kenkėjų/ nematodų platinimas","Trūkumai: žaladarių pavojus","Daugiametės svidrės","Occasionally a minor problem",3,{"$f":"HLOOKUP(Table2[[#This Row],[Catch crop]], Tool!C$29:M$29,1,0)","v":{"$error":"#N/A"}},null,{"$f":"100-Table2[[#This Row],[Achieved]]","v":100}]
["Augalų ligų platinimas","Trūkumai: žaladarių pavojus","Daugiametės svidrės","Occasionally a minor problem",3,{"$f":"HLOOKUP(Table2[[#This Row],[Catch crop]], Tool!C$29:M$29,1,0)","v":{"$error":"#N/A"}},null,{"$f":"100-Table2[[#This Row],[Achieved]]","v":100}]
["Piktžolėtumo pavojus","Trūkumai: žaladarių pavojus","Facelijos","Could be a minor problem",2,{"$f":"HLOOKUP(Table2[[#This Row],[Catch crop]], Tool!C$29:M$29,1,0)","v":{"$error":"#N/A"}},null,{"$f":"100-Table2[[#This Row],[Achieved]]","v":100}]
["Kenkėjų/ nematodų platinimas","Trūkumai: žaladarių pavojus","Facelijos","Not a problem",4,{"$f":"HLOOKUP(Table2[[#This Row],[Catch crop]], Tool!C$29:M$29,1,0)","v":{"$error":"#N/A"}},null,{"$f":"100-Table2[[#This Row],[Achieved]]","v":100}]
["Augalų ligų platinimas","Trūkumai: žaladarių pavojus","Facelijos","Occasionally a minor problem",3,{"$f":"HLOOKUP(Table2[[#This Row],[Catch crop]], Tool!C$29:M$29,1,0)","v":{"$error":"#N/A"}},null,{"$f":"100-Table2[[#This Row],[Achieved]]","v":100}]
["Piktžolėtumo pavojus","Trūkumai: žaladarių pavojus","Paprastosios šunažolės",null,null,{"$f":"HLOOKUP(Table2[[#This Row],[Catch crop]], Tool!C$29:M$29,1,0)","v":{"$error":"#N/A"}},null,{"$f":"100-Table2[[#This Row],[Achieved]]","v":100}]
["Kenkėjų/ nematodų platinimas","Trūkumai: žaladarių pavojus","Paprastosios šunažolės",null,null,{"$f":"HLOOKUP(Table2[[#This Row],[Catch crop]], Tool!C$29:M$29,1,0)","v":{"$error":"#N/A"}},null,{"$f":"100-Table2[[#This Row],[Achieved]]","v":100}]
["Augalų ligų platinimas","Trūkumai: žaladarių pavojus","Paprastosios šunažolės",null,null,{"$f":"HLOOKUP(Table2[[#This Row],[Catch crop]], Tool!C$29:M$29,1,0)","v":{"$error":"#N/A"}},null,{"$f":"100-Table2[[#This Row],[Achieved]]","v":100}]
["Piktžolėtumo pavojus","Trūkumai: žaladarių pavojus","Sėjamosios ir netikšės avižos","Occasionally a minor problem",3,{"$f":"HLOOKUP(Table2[[#This Row],[Catch crop]], Tool!C$29:M$29,1,0)","v":{"$error":"#N/A"}},null,{"$f":"100-Table2[[#This Row],[Achieved]]","v":100}]
["Kenkėjų/ nematodų platinimas","Trūkumai: žaladarių pavojus","Sėjamosios ir netikšės avižos","Could be a minor problem",2,{"$f":"HLOOKUP(Table2[[#This Row],[Catch crop]], Tool!C$29:M$29,1,0)","v":{"$error":"#N/A"}},null,{"$f":"100-Table2[[#This Row],[Achieved]]","v":100}]
["Augalų ligų platinimas","Trūkumai: žaladarių pavojus","Sėjamosios ir netikšės avižos","Occasionally a minor problem",3,{"$f":"HLOOKUP(Table2[[#This Row],[Catch crop]], Tool!C$29:M$29,1,0)","v":{"$error":"#N/A"}},null,{"$f":"100-Table2[[#This Row],[Achieved]]","v":100}]
["Piktžolėtumo pavojus","Trūkumai: žaladarių pavojus","Grikiai","Problem",0,{"$f":"HLOOKUP(Table2[[#This Row],[Catch crop]], Tool!C$29:M$29,1,0)","v":{"$error":"#N/A"}},null,{"$f":"100-Table2[[#This Row],[Achieved]]","v":100}]
["Kenkėjų/ nematodų platinimas","Trūkumai: žaladarių pavojus","Grikiai","Occasionally a minor problem",3,{"$f":"HLOOKUP(Table2[[#This Row],[Catch crop]], Tool!C$29:M$29,1,0)","v":{"$error":"#N/A"}},null,{"$f":"100-Table2[[#This Row],[Achieved]]","v":100}]
["Augalų ligų platinimas","Trūkumai: žaladarių pavojus","Grikiai","Not a problem",4,{"$f":"HLOOKUP(Table2[[#This Row],[Catch crop]], Tool!C$29:M$29,1,0)","v":{"$error":"#N/A"}},null,{"$f":"100-Table2[[#This Row],[Achieved]]","v":100}]
["Piktžolėtumo pavojus","Trūkumai: žaladarių pavojus","Žieminiai (ruginiai) vikiai","Could be a minor problem",2,{"$f":"HLOOKUP(Table2[[#This Row],[Catch crop]], Tool!C$29:M$29,1,0)","v":{"$error":"#N/A"}},null,{"$f":"100-Table2[[#This Row],[Achieved]]","v":100}]
["Kenkėjų/ nematodų platinimas","Trūkumai: žaladarių pavojus","Žieminiai (ruginiai) vikiai","Could be a minor problem",2,{"$f":"HLOOKUP(Table2[[#This Row],[Catch crop]], Tool!C$29:M$29,1,0)","v":{"$error":"#N/A"}},null,{"$f":"100-Table2[[#This Row],[Achieved]]","v":100}]
["Augalų ligų platinimas","Trūkumai: žaladarių pavojus","Žieminiai (ruginiai) vikiai","Not a problem",4,{"$f":"HLOOKUP(Table2[[#This Row],[Catch crop]], Tool!C$29:M$29,1,0)","v":{"$error":"#N/A"}},null,{"$f":"100-Table2[[#This Row],[Achieved]]","v":100}]
["Piktžolėtumo pavojus","Trūkumai: žaladarių pavojus","Sėjamieji žirniai","Not a problem",4,{"$f":"HLOOKUP(Table2[[#This Row],[Catch crop]], Tool!C$29:M$29,1,0)","v":{"$error":"#N/A"}},null,{"$f":"100-Table2[[#This Row],[Achieved]]","v":100}]
["Kenkėjų/ nematodų platinimas","Trūkumai: žaladarių pavojus","Sėjamieji žirniai","Could be a minor problem",2,{"$f":"HLOOKUP(Table2[[#This Row],[Catch crop]], Tool!C$29:M$29,1,0)","v":{"$error":"#N/A"}},null,{"$f":"100-Table2[[#This Row],[Achieved]]","v":100}]
["Augalų ligų platinimas","Trūkumai: žaladarių pavojus","Sėjamieji žirniai","Could be a moderate problem",1,{"$f":"HLOOKUP(Table2[[#This Row],[Catch crop]], Tool!C$29:M$29,1,0)","v":{"$error":"#N/A"}},null,{"$f":"100-Table2[[#This Row],[Achieved]]","v":100}]
["Piktžolėtumo pavojus","Trūkumai: žaladarių pavojus","Siauralapiai lubinai","Could be a minor problem",2,{"$f":"HLOOKUP(Table2[[#This Row],[Catch crop]], Tool!C$29:M$29,1,0)","v":{"$error":"#N/A"}},null,{"$f":"100-Table2[[#This Row],[Achieved]]","v":100}]
["Kenkėjų/ nematodų platinimas","Trūkumai: žaladarių pavojus","Siauralapiai lubinai","Could be a minor problem",2,{"$f":"HLOOKUP(Table2[[#This Row],[Catch crop]], Tool!C$29:M$29,1,0)","v":{"$error":"#N/A"}},null,{"$f":"100-Table2[[#This Row],[Achieved]]","v":100}]
["Augalų ligų platinimas","Trūkumai: žaladarių pavojus","Siauralapiai lubinai","Not a problem",4,{"$f":"HLOOKUP(Table2[[#This Row],[Catch crop]], Tool!C$29:M$29,1,0)","v":{"$error":"#N/A"}},null,{"$f":"100-Table2[[#This Row],[Achieved]]","v":100}]
["Piktžolėtumo pavojus","Trūkumai: žaladarių pavojus","Pupos","Not a problem",4,{"$f":"HLOOKUP(Table2[[#This Row],[Catch crop]], Tool!C$29:M$29,1,0)","v":{"$error":"#N/A"}},null,{"$f":"100-Table2[[#This Row],[Achieved]]","v":100}]
["Kenkėjų/ nematodų platinimas","Trūkumai: žaladarių pavojus","Pupos","Could be a minor problem",2,{"$f":"HLOOKUP(Table2[[#This Row],[Catch crop]], Tool!C$29:M$29,1,0)","v":{"$error":"#N/A"}},null,{"$f":"100-Table2[[#This Row],[Achieved]]","v":100}]
["Augalų ligų platinimas","Trūkumai: žaladarių pavojus","Pupos","Could be a moderate problem",1,{"$f":"HLOOKUP(Table2[[#This Row],[Catch crop]], Tool!C$29:M$29,1,0)","v":{"$error":"#N/A"}},null,{"$f":"100-Table2[[#This Row],[Achieved]]","v":100}]

{"sheet":" Pivot-Features","index":12,"n_rows":11,"n_cols":3,"rows_kept":11,"cut":false,"hidden":true,"merged":[]}
["Filter","(Multiple Items)"]
[]
["Max of Value","Column Labels"]
["Row Labels","Aliejiniai ridikai","Grand Total"]
["Privalumai: poveikis dirvožemiui",4,4]
["Podirvio purenimas",4,4]
["Judriųjų P ir K gausinimas",3,3]
["Armens purenimas",2,2]
["Naudingų vabzdžių pritraukimas",1,1]
["Tinkamumas trumpam laikotarpiui",3,3]
["Grand Total",4,4]

{"sheet":"Data for PAN release","index":13,"n_rows":169,"n_cols":12,"rows_kept":169,"cut":false,"hidden":true,"merged":[]}
["Catch crop","C:N ratio","PAN, kg/ha","Time, days","Filter","Biomass typical, t/ha","User biomass, t/ha","PAN typical, kg/ha"]
["Baltosios garstyčios",11.842105263157896,{"$f":"Table3[[#This Row],[PAN typical, kg/ha]]/Table3[[#This Row],[Biomass typical, t/ha]]*Table3[[#This Row],[User biomass, t/ha]]","v":9.7762225126068891},20,{"$f":"HLOOKUP(A:A,Tool!$C$29:$M$29,1,FALSE)","v":"Baltosios garstyčios"},2.3000000000000003,{"$f":"VLOOKUP(A:A,K:L,2,FALSE)","v":2.3000000000000003},9.7762225126068891,null,null,{"$f":"Tool!C113","v":"Baltosios garstyčios"},{"$f":"Tool!C115","v":2.3000000000000003}]
["Rudosios garstyčios",11.842105263157896,{"$f":"Table3[[#This Row],[PAN typical, kg/ha]]/Table3[[#This Row],[Biomass typical, t/ha]]*Table3[[#This Row],[User biomass, t/ha]]","v":{"$error":"#N/A"}},20,{"$f":"HLOOKUP(A:A,Tool!$C$29:$M$29,1,FALSE)","v":{"$error":"#N/A"}},2.3000000000000003,{"$f":"VLOOKUP(A:A,K:L,2,FALSE)","v":{"$error":"#N/A"}},9.7762225126068927,null,null,{"$f":"Tool!E113","v":"Vasariniai rapsai"},{"$f":"Tool!E115","v":1.55}]
["Vasariniai rapsai",12.5,{"$f":"Table3[[#This Row],[PAN typical, kg/ha]]/Table3[[#This Row],[Biomass typical, t/ha]]*Table3[[#This Row],[User biomass, t/ha]]","v":3.7306158334805644},20,{"$f":"HLOOKUP(A:A,Tool!$C$29:$M$29,1,FALSE)","v":"Vasariniai rapsai"},1.55,1.55,3.7306158334805644,null,null,{"$f":"Tool!G113","v":"Žieminiai rapsai"},{"$f":"Tool!G115","v":1.55}]
["Žieminiai rapsai",12.5,{"$f":"Table3[[#This Row],[PAN typical, kg/ha]]/Table3[[#This Row],[Biomass typical, t/ha]]*Table3[[#This Row],[User biomass, t/ha]]","v":3.7306158334805644},20,{"$f":"HLOOKUP(A:A,Tool!$C$29:$M$29,1,FALSE)","v":"Žieminiai rapsai"},1.55,1.55,3.7306158334805644,null,null,{"$f":"Tool!I113","v":"Aliejiniai ridikai"},{"$f":"Tool!I115","v":2.95}]
["Aliejiniai ridikai",12.162162162162161,{"$f":"Table3[[#This Row],[PAN typical, kg/ha]]/Table3[[#This Row],[Biomass typical, t/ha]]*Table3[[#This Row],[User biomass, t/ha]]","v":9.8124972122828584},20,{"$f":"HLOOKUP(A:A,Tool!$C$29:$M$29,1,FALSE)","v":"Aliejiniai ridikai"},2.95,2.95,9.8124972122828584,null,null,{"$f":"Tool!K113","v":"Žieminiai rapsiukai"},{"$f":"Tool!K115","v":1.65}]
["Šakniniai ridikai",13.23529411764706,{"$f":"Table3[[#This Row],[PAN typical, kg/ha]]/Table3[[#This Row],[Biomass typical, t/ha]]*Table3[[#This Row],[User biomass, t/ha]]","v":{"$error":"#N/A"}},20,{"$f":"HLOOKUP(A:A,Tool!$C$29:$M$29,1,FALSE)","v":{"$error":"#N/A"}},2.0500000000000003,{"$error":"#N/A"},1.1961654004991062,null,null,{"$f":"Tool!M113","v":"Žieminiai rugiai"},{"$f":"Tool!M115","v":1.25}]
["Žieminiai rapsiukai",13.23529411764706,{"$f":"Table3[[#This Row],[PAN typical, kg/ha]]/Table3[[#This Row],[Biomass typical, t/ha]]*Table3[[#This Row],[User biomass, t/ha]]","v":0.96276727357245107},20,{"$f":"HLOOKUP(A:A,Tool!$C$29:$M$29,1,FALSE)","v":"Žieminiai rapsiukai"},1.65,1.65,0.96276727357245107]
["Žieminiai rugiai",15,{"$f":"Table3[[#This Row],[PAN typical, kg/ha]]/Table3[[#This Row],[Biomass typical, t/ha]]*Table3[[#This Row],[User biomass, t/ha]]","v":-3.2998831378276829},20,{"$f":"HLOOKUP(A:A,Tool!$C$29:$M$29,1,FALSE)","v":"Žieminiai rugiai"},1.25,1.25,-3.2998831378276825]
["Baltieji dobilai",14.0625,{"$f":"Table3[[#This Row],[PAN typical, kg/ha]]/Table3[[#This Row],[Biomass typical, t/ha]]*Table3[[#This Row],[User biomass, t/ha]]","v":{"$error":"#N/A"}},20,{"$f":"HLOOKUP(A:A,Tool!$C$29:$M$29,1,FALSE)","v":{"$error":"#N/A"}},2.0500000000000003,{"$error":"#N/A"},-2.4958396432869669]
["Raudonieji dobilai",14.0625,{"$f":"Table3[[#This Row],[PAN typical, kg/ha]]/Table3[[#This Row],[Biomass typical, t/ha]]*Table3[[#This Row],[User biomass, t/ha]]","v":{"$error":"#N/A"}},20,{"$f":"HLOOKUP(A:A,Tool!$C$29:$M$29,1,FALSE)","v":{"$error":"#N/A"}},2.0500000000000003,{"$error":"#N/A"},-2.4958396432869669]
["Baltažiedžiai barkūnai",14.0625,{"$f":"Table3[[#This Row],[PAN typical, kg/ha]]/Table3[[#This Row],[Biomass typical, t/ha]]*Table3[[#This Row],[User biomass, t/ha]]","v":{"$error":"#N/A"}},20,{"$f":"HLOOKUP(A:A,Tool!$C$29:$M$29,1,FALSE)","v":{"$error":"#N/A"}},1.95,{"$error":"#N/A"},-2.3740913680046751]
["Gausiažiedės svidrės",18,{"$f":"Table3[[#This Row],[PAN typical, kg/ha]]/Table3[[#This Row],[Biomass typical, t/ha]]*Table3[[#This Row],[User biomass, t/ha]]","v":{"$error":"#N/A"}},20,{"$f":"HLOOKUP(A:A,Tool!$C$29:$M$29,1,FALSE)","v":{"$error":"#N/A"}},1.4,{"$error":"#N/A"},-4.1379425075976881]
["Daugiametės svidrės",18,{"$f":"Table3[[#This Row],[PAN typical, kg/ha]]/Table3[[#This Row],[Biomass typical, t/ha]]*Table3[[#This Row],[User biomass, t/ha]]","v":{"$error":"#N/A"}},20,{"$f":"HLOOKUP(A:A,Tool!$C$29:$M$29,1,FALSE)","v":{"$error":"#N/A"}},1.4,{"$error":"#N/A"},-4.1379425075976881]
["Facelijos",14.0625,{"$f":"Table3[[#This Row],[PAN typical, kg/ha]]/Table3[[#This Row],[Biomass typical, t/ha]]*Table3[[#This Row],[User biomass, t/ha]]","v":{"$error":"#N/A"}},20,{"$f":"HLOOKUP(A:A,Tool!$C$29:$M$29,1,FALSE)","v":{"$error":"#N/A"}},2.0500000000000003,{"$error":"#N/A"},-2.4958396432869669]
["Paprastosios šunažolės",17.307692307692307,{"$f":"Table3[[#This Row],[PAN typical, kg/ha]]/Table3[[#This Row],[Biomass typical, t/ha]]*Table3[[#This Row],[User biomass, t/ha]]","v":{"$error":"#N/A"}},20,{"$f":"HLOOKUP(A:A,Tool!$C$29:$M$29,1,FALSE)","v":{"$error":"#N/A"}},1.8499999999999999,{"$error":"#N/A"},-5.1782244503816823]
["Sėjamosios ir netikšės avižos",17.307692307692307,{"$f":"Table3[[#This Row],[PAN typical, kg/ha]]/Table3[[#This Row],[Biomass typical, t/ha]]*Table3[[#This Row],[User biomass, t/ha]]","v":{"$error":"#N/A"}},20,{"$f":"HLOOKUP(A:A,Tool!$C$29:$M$29,1,FALSE)","v":{"$error":"#N/A"}},1.8499999999999999,{"$error":"#N/A"},-5.1782244503816823]
["Grikiai",18.75,{"$f":"Table3[[#This Row],[PAN typical, kg/ha]]/Table3[[#This Row],[Biomass typical, t/ha]]*Table3[[#This Row],[User biomass, t/ha]]","v":{"$error":"#N/A"}},20,{"$f":"HLOOKUP(A:A,Tool!$C$29:$M$29,1,FALSE)","v":{"$error":"#N/A"}},1.8499999999999999,{"$error":"#N/A"},-5.8266768253392414]
["Žieminiai (ruginiai) vikiai",10,{"$f":"Table3[[#This Row],[PAN typical, kg/ha]]/Table3[[#This Row],[Biomass typical, t/ha]]*Table3[[#This Row],[User biomass, t/ha]]","v":{"$error":"#N/A"}},20,{"$f":"HLOOKUP(A:A,Tool!$C$29:$M$29,1,FALSE)","v":{"$error":"#N/A"}},1.65,{"$error":"#N/A"},17.882340184109207]
["Sėjamieji žirniai",11.25,{"$f":"Table3[[#This Row],[PAN typical, kg/ha]]/Table3[[#This Row],[Biomass typical, t/ha]]*Table3[[#This Row],[User biomass, t/ha]]","v":{"$error":"#N/A"}},20,{"$f":"HLOOKUP(A:A,Tool!$C$29:$M$29,1,FALSE)","v":{"$error":"#N/A"}},1.8499999999999999,{"$error":"#N/A"},11.308431689225642]
["Siauralapiai lubinai",11.25,{"$f":"Table3[[#This Row],[PAN typical, kg/ha]]/Table3[[#This Row],[Biomass typical, t/ha]]*Table3[[#This Row],[User biomass, t/ha]]","v":{"$error":"#N/A"}},20,{"$f":"HLOOKUP(A:A,Tool!$C$29:$M$29,1,FALSE)","v":{"$error":"#N/A"}},2.0500000000000003,{"$error":"#N/A"},12.530964844817607]
["Pupos",10,{"$f":"Table3[[#This Row],[PAN typical, kg/ha]]/Table3[[#This Row],[Biomass typical, t/ha]]*Table3[[#This Row],[User biomass, t/ha]]","v":{"$error":"#N/A"}},20,{"$f":"HLOOKUP(A:A,Tool!$C$29:$M$29,1,FALSE)","v":{"$error":"#N/A"}},1.95,{"$error":"#N/A"},21.133674763038158]
["Baltosios garstyčios",11.842105263157896,{"$f":"Table3[[#This Row],[PAN typical, kg/ha]]/Table3[[#This Row],[Biomass typical, t/ha]]*Table3[[#This Row],[User biomass, t/ha]]","v":16.5416241111216},40,{"$f":"HLOOKUP(A:A,Tool!$C$29:$M$29,1,FALSE)","v":"Baltosios garstyčios"},2.3000000000000003,2.3000000000000003,16.5416241111216]
["Rudosios garstyčios",11.842105263157896,{"$f":"Table3[[#This Row],[PAN typical, kg/ha]]/Table3[[#This Row],[Biomass typical, t/ha]]*Table3[[#This Row],[User biomass, t/ha]]","v":{"$error":"#N/A"}},40,{"$f":"HLOOKUP(A:A,Tool!$C$29:$M$29,1,FALSE)","v":{"$error":"#N/A"}},2.3000000000000003,{"$error":"#N/A"},16.541624111121589]
["Vasariniai rapsai",12.5,{"$f":"Table3[[#This Row],[PAN typical, kg/ha]]/Table3[[#This Row],[Biomass typical, t/ha]]*Table3[[#This Row],[User biomass, t/ha]]","v":8.1481919774133438},40,{"$f":"HLOOKUP(A:A,Tool!$C$29:$M$29,1,FALSE)","v":"Vasariniai rapsai"},1.55,1.55,8.1481919774133438]
["Žieminiai rapsai",12.5,{"$f":"Table3[[#This Row],[PAN typical, kg/ha]]/Table3[[#This Row],[Biomass typical, t/ha]]*Table3[[#This Row],[User biomass, t/ha]]","v":8.1481919774133438},40,{"$f":"HLOOKUP(A:A,Tool!$C$29:$M$29,1,FALSE)","v":"Žieminiai rapsai"},1.55,1.55,8.1481919774133438]
["Aliejiniai ridikai",12.162162162162161,{"$f":"Table3[[#This Row],[PAN typical, kg/ha]]/Table3[[#This Row],[Biomass typical, t/ha]]*Table3[[#This Row],[User biomass, t/ha]]","v":18.360345940393188},40,{"$f":"HLOOKUP(A:A,Tool!$C$29:$M$29,1,FALSE)","v":"Aliejiniai ridikai"},2.95,2.95,18.360345940393188]
["Šakniniai ridikai",13.23529411764706,{"$f":"Table3[[#This Row],[PAN typical, kg/ha]]/Table3[[#This Row],[Biomass typical, t/ha]]*Table3[[#This Row],[User biomass, t/ha]]","v":{"$error":"#N/A"}},40,{"$f":"HLOOKUP(A:A,Tool!$C$29:$M$29,1,FALSE)","v":{"$error":"#N/A"}},2.0500000000000003,{"$error":"#N/A"},6.8203579720473444]
["Žieminiai rapsiukai",13.23529411764706,{"$f":"Table3[[#This Row],[PAN typical, kg/ha]]/Table3[[#This Row],[Biomass typical, t/ha]]*Table3[[#This Row],[User biomass, t/ha]]","v":5.4895564165259092},40,{"$f":"HLOOKUP(A:A,Tool!$C$29:$M$29,1,FALSE)","v":"Žieminiai rapsiukai"},1.65,1.65,5.4895564165259092]
["Žieminiai rugiai",15,{"$f":"Table3[[#This Row],[PAN typical, kg/ha]]/Table3[[#This Row],[Biomass typical, t/ha]]*Table3[[#This Row],[User biomass, t/ha]]","v":-0.2450227019041358},40,{"$f":"HLOOKUP(A:A,Tool!$C$29:$M$29,1,FALSE)","v":"Žieminiai rugiai"},1.25,1.25,-0.2450227019041358]
["Baltieji dobilai",14.0625,{"$f":"Table3[[#This Row],[PAN typical, kg/ha]]/Table3[[#This Row],[Biomass typical, t/ha]]*Table3[[#This Row],[User biomass, t/ha]]","v":{"$error":"#N/A"}},40,{"$f":"HLOOKUP(A:A,Tool!$C$29:$M$29,1,FALSE)","v":{"$error":"#N/A"}},2.0500000000000003,{"$error":"#N/A"},2.876370378891409]
["Raudonieji dobilai",14.0625,{"$f":"Table3[[#This Row],[PAN typical, kg/ha]]/Table3[[#This Row],[Biomass typical, t/ha]]*Table3[[#This Row],[User biomass, t/ha]]","v":{"$error":"#N/A"}},40,{"$f":"HLOOKUP(A:A,Tool!$C$29:$M$29,1,FALSE)","v":{"$error":"#N/A"}},2.0500000000000003,{"$error":"#N/A"},2.876370378891409]
["Baltažiedžiai barkūnai",14.0625,{"$f":"Table3[[#This Row],[PAN typical, kg/ha]]/Table3[[#This Row],[Biomass typical, t/ha]]*Table3[[#This Row],[User biomass, t/ha]]","v":{"$error":"#N/A"}},40,{"$f":"HLOOKUP(A:A,Tool!$C$29:$M$29,1,FALSE)","v":{"$error":"#N/A"}},1.95,{"$error":"#N/A"},2.7360596287015833]
["Gausiažiedės svidrės",18,{"$f":"Table3[[#This Row],[PAN typical, kg/ha]]/Table3[[#This Row],[Biomass typical, t/ha]]*Table3[[#This Row],[User biomass, t/ha]]","v":{"$error":"#N/A"}},40,{"$f":"HLOOKUP(A:A,Tool!$C$29:$M$29,1,FALSE)","v":{"$error":"#N/A"}},1.4,{"$error":"#N/A"},-1.7998193113903305]
["Daugiametės svidrės",18,{"$f":"Table3[[#This Row],[PAN typical, kg/ha]]/Table3[[#This Row],[Biomass typical, t/ha]]*Table3[[#This Row],[User biomass, t/ha]]","v":{"$error":"#N/A"}},40,{"$f":"HLOOKUP(A:A,Tool!$C$29:$M$29,1,FALSE)","v":{"$error":"#N/A"}},1.4,{"$error":"#N/A"},-1.7998193113903305]
["Facelijos",14.0625,{"$f":"Table3[[#This Row],[PAN typical, kg/ha]]/Table3[[#This Row],[Biomass typical, t/ha]]*Table3[[#This Row],[User biomass, t/ha]]","v":{"$error":"#N/A"}},40,{"$f":"HLOOKUP(A:A,Tool!$C$29:$M$29,1,FALSE)","v":{"$error":"#N/A"}},2.0500000000000003,{"$error":"#N/A"},2.876370378891409]
["Paprastosios šunažolės",17.307692307692307,{"$f":"Table3[[#This Row],[PAN typical, kg/ha]]/Table3[[#This Row],[Biomass typical, t/ha]]*Table3[[#This Row],[User biomass, t/ha]]","v":{"$error":"#N/A"}},40,{"$f":"HLOOKUP(A:A,Tool!$C$29:$M$29,1,FALSE)","v":{"$error":"#N/A"}},1.8499999999999999,{"$error":"#N/A"},-1.8216567030190307]
["Sėjamosios ir netikšės avižos",17.307692307692307,{"$f":"Table3[[#This Row],[PAN typical, kg/ha]]/Table3[[#This Row],[Biomass typical, t/ha]]*Table3[[#This Row],[User biomass, t/ha]]","v":{"$error":"#N/A"}},40,{"$f":"HLOOKUP(A:A,Tool!$C$29:$M$29,1,FALSE)","v":{"$error":"#N/A"}},1.8499999999999999,{"$error":"#N/A"},-1.8216567030190307]
["Grikiai",18.75,{"$f":"Table3[[#This Row],[PAN typical, kg/ha]]/Table3[[#This Row],[Biomass typical, t/ha]]*Table3[[#This Row],[User biomass, t/ha]]","v":{"$error":"#N/A"}},40,{"$f":"HLOOKUP(A:A,Tool!$C$29:$M$29,1,FALSE)","v":{"$error":"#N/A"}},1.8499999999999999,{"$error":"#N/A"},-2.9973362000858774]
["Žieminiai (ruginiai) vikiai",10,{"$f":"Table3[[#This Row],[PAN typical, kg/ha]]/Table3[[#This Row],[Biomass typical, t/ha]]*Table3[[#This Row],[User biomass, t/ha]]","v":{"$error":"#N/A"}},40,{"$f":"HLOOKUP(A:A,Tool!$C$29:$M$29,1,FALSE)","v":{"$error":"#N/A"}},1.65,{"$error":"#N/A"},23.095395725705615]
["Sėjamieji žirniai",11.25,{"$f":"Table3[[#This Row],[PAN typical, kg/ha]]/Table3[[#This Row],[Biomass typical, t/ha]]*Table3[[#This Row],[User biomass, t/ha]]","v":{"$error":"#N/A"}},40,{"$f":"HLOOKUP(A:A,Tool!$C$29:$M$29,1,FALSE)","v":{"$error":"#N/A"}},1.8499999999999999,{"$error":"#N/A"},16.893598213077908]
["Siauralapiai lubinai",11.25,{"$f":"Table3[[#This Row],[PAN typical, kg/ha]]/Table3[[#This Row],[Biomass typical, t/ha]]*Table3[[#This Row],[User biomass, t/ha]]","v":{"$error":"#N/A"}},40,{"$f":"HLOOKUP(A:A,Tool!$C$29:$M$29,1,FALSE)","v":{"$error":"#N/A"}},2.0500000000000003,{"$error":"#N/A"},18.71993315503228]
["Pupos",10,{"$f":"Table3[[#This Row],[PAN typical, kg/ha]]/Table3[[#This Row],[Biomass typical, t/ha]]*Table3[[#This Row],[User biomass, t/ha]]","v":{"$error":"#N/A"}},40,{"$f":"HLOOKUP(A:A,Tool!$C$29:$M$29,1,FALSE)","v":{"$error":"#N/A"}},1.95,{"$error":"#N/A"},27.294558584924825]
["Baltosios garstyčios",11.842105263157896,{"$f":"Table3[[#This Row],[PAN typical, kg/ha]]/Table3[[#This Row],[Biomass typical, t/ha]]*Table3[[#This Row],[User biomass, t/ha]]","v":21.899538574818802},60,{"$f":"HLOOKUP(A:A,Tool!$C$29:$M$29,1,FALSE)","v":"Baltosios garstyčios"},2.3000000000000003,2.3000000000000003,21.899538574818799]
["Rudosios garstyčios",11.842105263157896,{"$f":"Table3[[#This Row],[PAN typical, kg/ha]]/Table3[[#This Row],[Biomass typical, t/ha]]*Table3[[#This Row],[User biomass, t/ha]]","v":{"$error":"#N/A"}},60,{"$f":"HLOOKUP(A:A,Tool!$C$29:$M$29,1,FALSE)","v":{"$error":"#N/A"}},2.3000000000000003,{"$error":"#N/A"},21.89953857481882]
["Vasariniai rapsai",12.5,{"$f":"Table3[[#This Row],[PAN typical, kg/ha]]/Table3[[#This Row],[Biomass typical, t/ha]]*Table3[[#This Row],[User biomass, t/ha]]","v":11.808909678050464},60,{"$f":"HLOOKUP(A:A,Tool!$C$29:$M$29,1,FALSE)","v":"Vasariniai rapsai"},1.55,1.55,11.808909678050464]
["Žieminiai rapsai",12.5,{"$f":"Table3[[#This Row],[PAN typical, kg/ha]]/Table3[[#This Row],[Biomass typical, t/ha]]*Table3[[#This Row],[User biomass, t/ha]]","v":11.808909678050464},60,{"$f":"HLOOKUP(A:A,Tool!$C$29:$M$29,1,FALSE)","v":"Žieminiai rapsai"},1.55,1.55,11.808909678050464]
["Aliejiniai ridikai",12.162162162162161,{"$f":"Table3[[#This Row],[PAN typical, kg/ha]]/Table3[[#This Row],[Biomass typical, t/ha]]*Table3[[#This Row],[User biomass, t/ha]]","v":25.280099210103415},60,{"$f":"HLOOKUP(A:A,Tool!$C$29:$M$29,1,FALSE)","v":"Aliejiniai ridikai"},2.95,2.95,25.280099210103415]
["Šakniniai ridikai",13.23529411764706,{"$f":"Table3[[#This Row],[PAN typical, kg/ha]]/Table3[[#This Row],[Biomass typical, t/ha]]*Table3[[#This Row],[User biomass, t/ha]]","v":{"$error":"#N/A"}},60,{"$f":"HLOOKUP(A:A,Tool!$C$29:$M$29,1,FALSE)","v":{"$error":"#N/A"}},2.0500000000000003,{"$error":"#N/A"},11.727055322630749]
["Žieminiai rapsiukai",13.23529411764706,{"$f":"Table3[[#This Row],[PAN typical, kg/ha]]/Table3[[#This Row],[Biomass typical, t/ha]]*Table3[[#This Row],[User biomass, t/ha]]","v":9.4388494060198678},60,{"$f":"HLOOKUP(A:A,Tool!$C$29:$M$29,1,FALSE)","v":"Žieminiai rapsiukai"},1.65,1.65,9.4388494060198678]
["Žieminiai rugiai",15,{"$f":"Table3[[#This Row],[PAN typical, kg/ha]]/Table3[[#This Row],[Biomass typical, t/ha]]*Table3[[#This Row],[User biomass, t/ha]]","v":2.7485569029086223},60,{"$f":"HLOOKUP(A:A,Tool!$C$29:$M$29,1,FALSE)","v":"Žieminiai rugiai"},1.25,1.25,2.7485569029086223]
["Baltieji dobilai",14.0625,{"$f":"Table3[[#This Row],[PAN typical, kg/ha]]/Table3[[#This Row],[Biomass typical, t/ha]]*Table3[[#This Row],[User biomass, t/ha]]","v":{"$error":"#N/A"}},60,{"$f":"HLOOKUP(A:A,Tool!$C$29:$M$29,1,FALSE)","v":{"$error":"#N/A"}},2.0500000000000003,{"$error":"#N/A"},7.8464708885632248]
["Raudonieji dobilai",14.0625,{"$f":"Table3[[#This Row],[PAN typical, kg/ha]]/Table3[[#This Row],[Biomass typical, t/ha]]*Table3[[#This Row],[User biomass, t/ha]]","v":{"$error":"#N/A"}},60,{"$f":"HLOOKUP(A:A,Tool!$C$29:$M$29,1,FALSE)","v":{"$error":"#N/A"}},2.0500000000000003,{"$error":"#N/A"},7.8464708885632248]
["Baltažiedžiai barkūnai",14.0625,{"$f":"Table3[[#This Row],[PAN typical, kg/ha]]/Table3[[#This Row],[Biomass typical, t/ha]]*Table3[[#This Row],[User biomass, t/ha]]","v":{"$error":"#N/A"}},60,{"$f":"HLOOKUP(A:A,Tool!$C$29:$M$29,1,FALSE)","v":{"$error":"#N/A"}},1.95,{"$error":"#N/A"},7.4637162110723345]
["Gausiažiedės svidrės",18,{"$f":"Table3[[#This Row],[PAN typical, kg/ha]]/Table3[[#This Row],[Biomass typical, t/ha]]*Table3[[#This Row],[User biomass, t/ha]]","v":{"$error":"#N/A"}},60,{"$f":"HLOOKUP(A:A,Tool!$C$29:$M$29,1,FALSE)","v":{"$error":"#N/A"}},1.4,{"$error":"#N/A"},0.70742676387712566]
["Daugiametės svidrės",18,{"$f":"Table3[[#This Row],[PAN typical, kg/ha]]/Table3[[#This Row],[Biomass typical, t/ha]]*Table3[[#This Row],[User biomass, t/ha]]","v":{"$error":"#N/A"}},60,{"$f":"HLOOKUP(A:A,Tool!$C$29:$M$29,1,FALSE)","v":{"$error":"#N/A"}},1.4,{"$error":"#N/A"},0.70742676387712566]
["Facelijos",14.0625,{"$f":"Table3[[#This Row],[PAN typical, kg/ha]]/Table3[[#This Row],[Biomass typical, t/ha]]*Table3[[#This Row],[User biomass, t/ha]]","v":{"$error":"#N/A"}},60,{"$f":"HLOOKUP(A:A,Tool!$C$29:$M$29,1,FALSE)","v":{"$error":"#N/A"}},2.0500000000000003,{"$error":"#N/A"},7.8464708885632248]
["Paprastosios šunažolės",17.307692307692307,{"$f":"Table3[[#This Row],[PAN typical, kg/ha]]/Table3[[#This Row],[Biomass typical, t/ha]]*Table3[[#This Row],[User biomass, t/ha]]","v":{"$error":"#N/A"}},60,{"$f":"HLOOKUP(A:A,Tool!$C$29:$M$29,1,FALSE)","v":{"$error":"#N/A"}},1.8499999999999999,{"$error":"#N/A"},1.6832399620973837]
["Sėjamosios ir netikšės avižos",17.307692307692307,{"$f":"Table3[[#This Row],[PAN typical, kg/ha]]/Table3[[#This Row],[Biomass typical, t/ha]]*Table3[[#This Row],[User biomass, t/ha]]","v":{"$error":"#N/A"}},60,{"$f":"HLOOKUP(A:A,Tool!$C$29:$M$29,1,FALSE)","v":{"$error":"#N/A"}},1.8499999999999999,{"$error":"#N/A"},1.6832399620973837]
["Grikiai",18.75,{"$f":"Table3[[#This Row],[PAN typical, kg/ha]]/Table3[[#This Row],[Biomass typical, t/ha]]*Table3[[#This Row],[User biomass, t/ha]]","v":{"$error":"#N/A"}},60,{"$f":"HLOOKUP(A:A,Tool!$C$29:$M$29,1,FALSE)","v":{"$error":"#N/A"}},1.8499999999999999,{"$error":"#N/A"},0.13707286049438763]
["Žieminiai (ruginiai) vikiai",10,{"$f":"Table3[[#This Row],[PAN typical, kg/ha]]/Table3[[#This Row],[Biomass typical, t/ha]]*Table3[[#This Row],[User biomass, t/ha]]","v":{"$error":"#N/A"}},60,{"$f":"HLOOKUP(A:A,Tool!$C$29:$M$29,1,FALSE)","v":{"$error":"#N/A"}},1.65,{"$error":"#N/A"},26.753322827792026]
["Sėjamieji žirniai",11.25,{"$f":"Table3[[#This Row],[PAN typical, kg/ha]]/Table3[[#This Row],[Biomass typical, t/ha]]*Table3[[#This Row],[User biomass, t/ha]]","v":{"$error":"#N/A"}},60,{"$f":"HLOOKUP(A:A,Tool!$C$29:$M$29,1,FALSE)","v":{"$error":"#N/A"}},1.8499999999999999,{"$error":"#N/A"},21.143297805537269]
["Siauralapiai lubinai",11.25,{"$f":"Table3[[#This Row],[PAN typical, kg/ha]]/Table3[[#This Row],[Biomass typical, t/ha]]*Table3[[#This Row],[User biomass, t/ha]]","v":{"$error":"#N/A"}},60,{"$f":"HLOOKUP(A:A,Tool!$C$29:$M$29,1,FALSE)","v":{"$error":"#N/A"}},2.0500000000000003,{"$error":"#N/A"},23.429059730460221]
["Pupos",10,{"$f":"Table3[[#This Row],[PAN typical, kg/ha]]/Table3[[#This Row],[Biomass typical, t/ha]]*Table3[[#This Row],[User biomass, t/ha]]","v":{"$error":"#N/A"}},60,{"$f":"HLOOKUP(A:A,Tool!$C$29:$M$29,1,FALSE)","v":{"$error":"#N/A"}},1.95,{"$error":"#N/A"},31.617563341936034]
["Baltosios garstyčios",11.842105263157896,{"$f":"Table3[[#This Row],[PAN typical, kg/ha]]/Table3[[#This Row],[Biomass typical, t/ha]]*Table3[[#This Row],[User biomass, t/ha]]","v":26.199963390295299},80,{"$f":"HLOOKUP(A:A,Tool!$C$29:$M$29,1,FALSE)","v":"Baltosios garstyčios"},2.3000000000000003,2.3000000000000003,26.199963390295299]
["Rudosios garstyčios",11.842105263157896,{"$f":"Table3[[#This Row],[PAN typical, kg/ha]]/Table3[[#This Row],[Biomass typical, t/ha]]*Table3[[#This Row],[User biomass, t/ha]]","v":{"$error":"#N/A"}},80,{"$f":"HLOOKUP(A:A,Tool!$C$29:$M$29,1,FALSE)","v":{"$error":"#N/A"}},2.3000000000000003,{"$error":"#N/A"},26.199963390295348]
["Vasariniai rapsai",12.5,{"$f":"Table3[[#This Row],[PAN typical, kg/ha]]/Table3[[#This Row],[Biomass typical, t/ha]]*Table3[[#This Row],[User biomass, t/ha]]","v":14.759635628980169},80,{"$f":"HLOOKUP(A:A,Tool!$C$29:$M$29,1,FALSE)","v":"Vasariniai rapsai"},1.55,{"$f":"VLOOKUP(A:A,K:L,2,FALSE)","v":1.55},14.759635628980169]
["Žieminiai rapsai",12.5,{"$f":"Table3[[#This Row],[PAN typical, kg/ha]]/Table3[[#This Row],[Biomass typical, t/ha]]*Table3[[#This Row],[User biomass, t/ha]]","v":14.759635628980169},80,{"$f":"HLOOKUP(A:A,Tool!$C$29:$M$29,1,FALSE)","v":"Žieminiai rapsai"},1.55,1.55,14.759635628980169]
["Aliejiniai ridikai",12.162162162162161,{"$f":"Table3[[#This Row],[PAN typical, kg/ha]]/Table3[[#This Row],[Biomass typical, t/ha]]*Table3[[#This Row],[User biomass, t/ha]]","v":30.845324090323313},80,{"$f":"HLOOKUP(A:A,Tool!$C$29:$M$29,1,FALSE)","v":"Aliejiniai ridikai"},2.95,2.95,30.845324090323309]
["Šakniniai ridikai",13.23529411764706,{"$f":"Table3[[#This Row],[PAN typical, kg/ha]]/Table3[[#This Row],[Biomass typical, t/ha]]*Table3[[#This Row],[User biomass, t/ha]]","v":{"$error":"#N/A"}},80,{"$f":"HLOOKUP(A:A,Tool!$C$29:$M$29,1,FALSE)","v":{"$error":"#N/A"}},2.0500000000000003,{"$error":"#N/A"},15.702654620885699]
["Žieminiai rapsiukai",13.23529411764706,{"$f":"Table3[[#This Row],[PAN typical, kg/ha]]/Table3[[#This Row],[Biomass typical, t/ha]]*Table3[[#This Row],[User biomass, t/ha]]","v":12.638722011932387},80,{"$f":"HLOOKUP(A:A,Tool!$C$29:$M$29,1,FALSE)","v":"Žieminiai rapsiukai"},1.65,1.65,12.638722011932387]
["Žieminiai rugiai",15,{"$f":"Table3[[#This Row],[PAN typical, kg/ha]]/Table3[[#This Row],[Biomass typical, t/ha]]*Table3[[#This Row],[User biomass, t/ha]]","v":5.2053141658798809},80,{"$f":"HLOOKUP(A:A,Tool!$C$29:$M$29,1,FALSE)","v":"Žieminiai rugiai"},1.25,1.25,5.2053141658798809]
["Baltieji dobilai",14.0625,{"$f":"Table3[[#This Row],[PAN typical, kg/ha]]/Table3[[#This Row],[Biomass typical, t/ha]]*Table3[[#This Row],[User biomass, t/ha]]","v":{"$error":"#N/A"}},80,{"$f":"HLOOKUP(A:A,Tool!$C$29:$M$29,1,FALSE)","v":{"$error":"#N/A"}},2.0500000000000003,{"$error":"#N/A"},11.898682488327236]
["Raudonieji dobilai",14.0625,{"$f":"Table3[[#This Row],[PAN typical, kg/ha]]/Table3[[#This Row],[Biomass typical, t/ha]]*Table3[[#This Row],[User biomass, t/ha]]","v":{"$error":"#N/A"}},80,{"$f":"HLOOKUP(A:A,Tool!$C$29:$M$29,1,FALSE)","v":{"$error":"#N/A"}},2.0500000000000003,{"$error":"#N/A"},11.898682488327236]
["Baltažiedžiai barkūnai",14.0625,{"$f":"Table3[[#This Row],[PAN typical, kg/ha]]/Table3[[#This Row],[Biomass typical, t/ha]]*Table3[[#This Row],[User biomass, t/ha]]","v":{"$error":"#N/A"}},80,{"$f":"HLOOKUP(A:A,Tool!$C$29:$M$29,1,FALSE)","v":{"$error":"#N/A"}},1.95,{"$error":"#N/A"},11.31825895231127]
["Gausiažiedės svidrės",18,{"$f":"Table3[[#This Row],[PAN typical, kg/ha]]/Table3[[#This Row],[Biomass typical, t/ha]]*Table3[[#This Row],[User biomass, t/ha]]","v":{"$error":"#N/A"}},80,{"$f":"HLOOKUP(A:A,Tool!$C$29:$M$29,1,FALSE)","v":{"$error":"#N/A"}},1.4,{"$error":"#N/A"},2.7921759117774645]
["Daugiametės svidrės",18,{"$f":"Table3[[#This Row],[PAN typical, kg/ha]]/Table3[[#This Row],[Biomass typical, t/ha]]*Table3[[#This Row],[User biomass, t/ha]]","v":{"$error":"#N/A"}},80,{"$f":"HLOOKUP(A:A,Tool!$C$29:$M$29,1,FALSE)","v":{"$error":"#N/A"}},1.4,{"$error":"#N/A"},2.7921759117774645]
["Facelijos",14.0625,{"$f":"Table3[[#This Row],[PAN typical, kg/ha]]/Table3[[#This Row],[Biomass typical, t/ha]]*Table3[[#This Row],[User biomass, t/ha]]","v":{"$error":"#N/A"}},80,{"$f":"HLOOKUP(A:A,Tool!$C$29:$M$29,1,FALSE)","v":{"$error":"#N/A"}},2.0500000000000003,{"$error":"#N/A"},11.898682488327236]
["Paprastosios šunažolės",17.307692307692307,{"$f":"Table3[[#This Row],[PAN typical, kg/ha]]/Table3[[#This Row],[Biomass typical, t/ha]]*Table3[[#This Row],[User biomass, t/ha]]","v":{"$error":"#N/A"}},80,{"$f":"HLOOKUP(A:A,Tool!$C$29:$M$29,1,FALSE)","v":{"$error":"#N/A"}},1.8499999999999999,{"$error":"#N/A"},4.5868253612159036]
["Sėjamosios ir netikšės avižos",17.307692307692307,{"$f":"Table3[[#This Row],[PAN typical, kg/ha]]/Table3[[#This Row],[Biomass typical, t/ha]]*Table3[[#This Row],[User biomass, t/ha]]","v":{"$error":"#N/A"}},80,{"$f":"HLOOKUP(A:A,Tool!$C$29:$M$29,1,FALSE)","v":{"$error":"#N/A"}},1.8499999999999999,{"$error":"#N/A"},4.5868253612159036]
["Grikiai",18.75,{"$f":"Table3[[#This Row],[PAN typical, kg/ha]]/Table3[[#This Row],[Biomass typical, t/ha]]*Table3[[#This Row],[User biomass, t/ha]]","v":{"$error":"#N/A"}},80,{"$f":"HLOOKUP(A:A,Tool!$C$29:$M$29,1,FALSE)","v":{"$error":"#N/A"}},1.8499999999999999,{"$error":"#N/A"},2.7547840266076391]
["Žieminiai (ruginiai) vikiai",10,{"$f":"Table3[[#This Row],[PAN typical, kg/ha]]/Table3[[#This Row],[Biomass typical, t/ha]]*Table3[[#This Row],[User biomass, t/ha]]","v":{"$error":"#N/A"}},80,{"$f":"HLOOKUP(A:A,Tool!$C$29:$M$29,1,FALSE)","v":{"$error":"#N/A"}},1.65,{"$error":"#N/A"},29.662354745473426]
["Sėjamieji žirniai",11.25,{"$f":"Table3[[#This Row],[PAN typical, kg/ha]]/Table3[[#This Row],[Biomass typical, t/ha]]*Table3[[#This Row],[User biomass, t/ha]]","v":{"$error":"#N/A"}},80,{"$f":"HLOOKUP(A:A,Tool!$C$29:$M$29,1,FALSE)","v":{"$error":"#N/A"}},1.8499999999999999,{"$error":"#N/A"},24.542502868555179]
["Siauralapiai lubinai",11.25,{"$f":"Table3[[#This Row],[PAN typical, kg/ha]]/Table3[[#This Row],[Biomass typical, t/ha]]*Table3[[#This Row],[User biomass, t/ha]]","v":{"$error":"#N/A"}},80,{"$f":"HLOOKUP(A:A,Tool!$C$29:$M$29,1,FALSE)","v":{"$error":"#N/A"}},2.0500000000000003,{"$error":"#N/A"},27.195746421912499]
["Pupos",10,{"$f":"Table3[[#This Row],[PAN typical, kg/ha]]/Table3[[#This Row],[Biomass typical, t/ha]]*Table3[[#This Row],[User biomass, t/ha]]","v":{"$error":"#N/A"}},80,{"$f":"HLOOKUP(A:A,Tool!$C$29:$M$29,1,FALSE)","v":{"$error":"#N/A"}},1.95,{"$error":"#N/A"},35.055510153741324]
["Baltosios garstyčios",11.842105263157896,{"$f":"Table3[[#This Row],[PAN typical, kg/ha]]/Table3[[#This Row],[Biomass typical, t/ha]]*Table3[[#This Row],[User biomass, t/ha]]","v":29.655840897789503},100,{"$f":"HLOOKUP(A:A,Tool!$C$29:$M$29,1,FALSE)","v":"Baltosios garstyčios"},2.3000000000000003,2.3000000000000003,29.655840897789499]
["Rudosios garstyčios",11.842105263157896,{"$f":"Table3[[#This Row],[PAN typical, kg/ha]]/Table3[[#This Row],[Biomass typical, t/ha]]*Table3[[#This Row],[User biomass, t/ha]]","v":{"$error":"#N/A"}},100,{"$f":"HLOOKUP(A:A,Tool!$C$29:$M$29,1,FALSE)","v":{"$error":"#N/A"}},2.3000000000000003,{"$error":"#N/A"},29.655840897789457]
["Vasariniai rapsai",12.5,{"$f":"Table3[[#This Row],[PAN typical, kg/ha]]/Table3[[#This Row],[Biomass typical, t/ha]]*Table3[[#This Row],[User biomass, t/ha]]","v":17.131832399581008},100,{"$f":"HLOOKUP(A:A,Tool!$C$29:$M$29,1,FALSE)","v":"Vasariniai rapsai"},1.55,1.55,17.131832399581008]
["Žieminiai rapsai",12.5,{"$f":"Table3[[#This Row],[PAN typical, kg/ha]]/Table3[[#This Row],[Biomass typical, t/ha]]*Table3[[#This Row],[User biomass, t/ha]]","v":17.131832399581008},100,{"$f":"HLOOKUP(A:A,Tool!$C$29:$M$29,1,FALSE)","v":"Žieminiai rapsai"},1.55,1.55,17.131832399581008]
["Aliejiniai ridikai",12.162162162162161,{"$f":"Table3[[#This Row],[PAN typical, kg/ha]]/Table3[[#This Row],[Biomass typical, t/ha]]*Table3[[#This Row],[User biomass, t/ha]]","v":35.318438647688176},100,{"$f":"HLOOKUP(A:A,Tool!$C$29:$M$29,1,FALSE)","v":"Aliejiniai ridikai"},2.95,2.95,35.318438647688176]
["Šakniniai ridikai",13.23529411764706,{"$f":"Table3[[#This Row],[PAN typical, kg/ha]]/Table3[[#This Row],[Biomass typical, t/ha]]*Table3[[#This Row],[User biomass, t/ha]]","v":{"$error":"#N/A"}},100,{"$f":"HLOOKUP(A:A,Tool!$C$29:$M$29,1,FALSE)","v":{"$error":"#N/A"}},2.0500000000000003,{"$error":"#N/A"},18.900542883489134]
["Žieminiai rapsiukai",13.23529411764706,{"$f":"Table3[[#This Row],[PAN typical, kg/ha]]/Table3[[#This Row],[Biomass typical, t/ha]]*Table3[[#This Row],[User biomass, t/ha]]","v":15.212632076954666},100,{"$f":"HLOOKUP(A:A,Tool!$C$29:$M$29,1,FALSE)","v":"Žieminiai rapsiukai"},1.65,1.65,15.212632076954664]
["Žieminiai rugiai",15,{"$f":"Table3[[#This Row],[PAN typical, kg/ha]]/Table3[[#This Row],[Biomass typical, t/ha]]*Table3[[#This Row],[User biomass, t/ha]]","v":7.1846278398075247},100,{"$f":"HLOOKUP(A:A,Tool!$C$29:$M$29,1,FALSE)","v":"Žieminiai rugiai"},1.25,1.25,7.1846278398075247]
["Baltieji dobilai",14.0625,{"$f":"Table3[[#This Row],[PAN typical, kg/ha]]/Table3[[#This Row],[Biomass typical, t/ha]]*Table3[[#This Row],[User biomass, t/ha]]","v":{"$error":"#N/A"}},100,{"$f":"HLOOKUP(A:A,Tool!$C$29:$M$29,1,FALSE)","v":{"$error":"#N/A"}},2.0500000000000003,{"$error":"#N/A"},15.160590778561454]
["Raudonieji dobilai",14.0625,{"$f":"Table3[[#This Row],[PAN typical, kg/ha]]/Table3[[#This Row],[Biomass typical, t/ha]]*Table3[[#This Row],[User biomass, t/ha]]","v":{"$error":"#N/A"}},100,{"$f":"HLOOKUP(A:A,Tool!$C$29:$M$29,1,FALSE)","v":{"$error":"#N/A"}},2.0500000000000003,{"$error":"#N/A"},15.160590778561454]
["Baltažiedžiai barkūnai",14.0625,{"$f":"Table3[[#This Row],[PAN typical, kg/ha]]/Table3[[#This Row],[Biomass typical, t/ha]]*Table3[[#This Row],[User biomass, t/ha]]","v":{"$error":"#N/A"}},100,{"$f":"HLOOKUP(A:A,Tool!$C$29:$M$29,1,FALSE)","v":{"$error":"#N/A"}},1.95,{"$error":"#N/A"},14.421049764973088]
["Gausiažiedės svidrės",18,{"$f":"Table3[[#This Row],[PAN typical, kg/ha]]/Table3[[#This Row],[Biomass typical, t/ha]]*Table3[[#This Row],[User biomass, t/ha]]","v":{"$error":"#N/A"}},100,{"$f":"HLOOKUP(A:A,Tool!$C$29:$M$29,1,FALSE)","v":{"$error":"#N/A"}},1.4,{"$error":"#N/A"},4.4754352867640863]
["Daugiametės svidrės",18,{"$f":"Table3[[#This Row],[PAN typical, kg/ha]]/Table3[[#This Row],[Biomass typical, t/ha]]*Table3[[#This Row],[User biomass, t/ha]]","v":{"$error":"#N/A"}},100,{"$f":"HLOOKUP(A:A,Tool!$C$29:$M$29,1,FALSE)","v":{"$error":"#N/A"}},1.4,{"$error":"#N/A"},4.4754352867640863]
["Facelijos",14.0625,{"$f":"Table3[[#This Row],[PAN typical, kg/ha]]/Table3[[#This Row],[Biomass typical, t/ha]]*Table3[[#This Row],[User biomass, t/ha]]","v":{"$error":"#N/A"}},100,{"$f":"HLOOKUP(A:A,Tool!$C$29:$M$29,1,FALSE)","v":{"$error":"#N/A"}},2.0500000000000003,{"$error":"#N/A"},15.160590778561454]
["Paprastosios šunažolės",17.307692307692307,{"$f":"Table3[[#This Row],[PAN typical, kg/ha]]/Table3[[#This Row],[Biomass typical, t/ha]]*Table3[[#This Row],[User biomass, t/ha]]","v":{"$error":"#N/A"}},100,{"$f":"HLOOKUP(A:A,Tool!$C$29:$M$29,1,FALSE)","v":{"$error":"#N/A"}},1.8499999999999999,{"$error":"#N/A"},6.9297732964943251]
["Sėjamosios ir netikšės avižos",17.307692307692307,{"$f":"Table3[[#This Row],[PAN typical, kg/ha]]/Table3[[#This Row],[Biomass typical, t/ha]]*Table3[[#This Row],[User biomass, t/ha]]","v":{"$error":"#N/A"}},100,{"$f":"HLOOKUP(A:A,Tool!$C$29:$M$29,1,FALSE)","v":{"$error":"#N/A"}},1.8499999999999999,{"$error":"#N/A"},6.9297732964943251]
["Grikiai",18.75,{"$f":"Table3[[#This Row],[PAN typical, kg/ha]]/Table3[[#This Row],[Biomass typical, t/ha]]*Table3[[#This Row],[User biomass, t/ha]]","v":{"$error":"#N/A"}},100,{"$f":"HLOOKUP(A:A,Tool!$C$29:$M$29,1,FALSE)","v":{"$error":"#N/A"}},1.8499999999999999,{"$error":"#N/A"},4.8699553944397493]
["Žieminiai (ruginiai) vikiai",10,{"$f":"Table3[[#This Row],[PAN typical, kg/ha]]/Table3[[#This Row],[Biomass typical, t/ha]]*Table3[[#This Row],[User biomass, t/ha]]","v":{"$error":"#N/A"}},100,{"$f":"HLOOKUP(A:A,Tool!$C$29:$M$29,1,FALSE)","v":{"$error":"#N/A"}},1.65,{"$error":"#N/A"},31.998582574867189]
["Sėjamieji žirniai",11.25,{"$f":"Table3[[#This Row],[PAN typical, kg/ha]]/Table3[[#This Row],[Biomass typical, t/ha]]*Table3[[#This Row],[User biomass, t/ha]]","v":{"$error":"#N/A"}},100,{"$f":"HLOOKUP(A:A,Tool!$C$29:$M$29,1,FALSE)","v":{"$error":"#N/A"}},1.8499999999999999,{"$error":"#N/A"},27.273367309380014]
["Siauralapiai lubinai",11.25,{"$f":"Table3[[#This Row],[PAN typical, kg/ha]]/Table3[[#This Row],[Biomass typical, t/ha]]*Table3[[#This Row],[User biomass, t/ha]]","v":{"$error":"#N/A"}},100,{"$f":"HLOOKUP(A:A,Tool!$C$29:$M$29,1,FALSE)","v":{"$error":"#N/A"}},2.0500000000000003,{"$error":"#N/A"},30.221839450934617]
["Pupos",10,{"$f":"Table3[[#This Row],[PAN typical, kg/ha]]/Table3[[#This Row],[Biomass typical, t/ha]]*Table3[[#This Row],[User biomass, t/ha]]","v":{"$error":"#N/A"}},100,{"$f":"HLOOKUP(A:A,Tool!$C$29:$M$29,1,FALSE)","v":{"$error":"#N/A"}},1.95,{"$error":"#N/A"},37.816506679388503]
["Baltosios garstyčios",11.842105263157896,{"$f":"Table3[[#This Row],[PAN typical, kg/ha]]/Table3[[#This Row],[Biomass typical, t/ha]]*Table3[[#This Row],[User biomass, t/ha]]","v":32.433337336250297},120,{"$f":"HLOOKUP(A:A,Tool!$C$29:$M$29,1,FALSE)","v":"Baltosios garstyčios"},2.3000000000000003,2.3000000000000003,32.433337336250297]
["Rudosios garstyčios",11.842105263157896,{"$f":"Table3[[#This Row],[PAN typical, kg/ha]]/Table3[[#This Row],[Biomass typical, t/ha]]*Table3[[#This Row],[User biomass, t/ha]]","v":{"$error":"#N/A"}},120,{"$f":"HLOOKUP(A:A,Tool!$C$29:$M$29,1,FALSE)","v":{"$error":"#N/A"}},2.3000000000000003,{"$error":"#N/A"},32.433337336250261]
["Vasariniai rapsai",12.5,{"$f":"Table3[[#This Row],[PAN typical, kg/ha]]/Table3[[#This Row],[Biomass typical, t/ha]]*Table3[[#This Row],[User biomass, t/ha]]","v":19.038445006462926},120,{"$f":"HLOOKUP(A:A,Tool!$C$29:$M$29,1,FALSE)","v":"Vasariniai rapsai"},1.55,1.55,19.038445006462926]
["Žieminiai rapsai",12.5,{"$f":"Table3[[#This Row],[PAN typical, kg/ha]]/Table3[[#This Row],[Biomass typical, t/ha]]*Table3[[#This Row],[User biomass, t/ha]]","v":19.038445006462926},120,{"$f":"HLOOKUP(A:A,Tool!$C$29:$M$29,1,FALSE)","v":"Žieminiai rapsai"},1.55,1.55,19.038445006462926]
["Aliejiniai ridikai",12.162162162162161,{"$f":"Table3[[#This Row],[PAN typical, kg/ha]]/Table3[[#This Row],[Biomass typical, t/ha]]*Table3[[#This Row],[User biomass, t/ha]]","v":38.913551687897112},120,{"$f":"HLOOKUP(A:A,Tool!$C$29:$M$29,1,FALSE)","v":"Aliejiniai ridikai"},2.95,2.95,38.913551687897112]
["Šakniniai ridikai",13.23529411764706,{"$f":"Table3[[#This Row],[PAN typical, kg/ha]]/Table3[[#This Row],[Biomass typical, t/ha]]*Table3[[#This Row],[User biomass, t/ha]]","v":{"$error":"#N/A"}},120,{"$f":"HLOOKUP(A:A,Tool!$C$29:$M$29,1,FALSE)","v":{"$error":"#N/A"}},2.0500000000000003,{"$error":"#N/A"},21.470941259945885]
["Žieminiai rapsiukai",13.23529411764706,{"$f":"Table3[[#This Row],[PAN typical, kg/ha]]/Table3[[#This Row],[Biomass typical, t/ha]]*Table3[[#This Row],[User biomass, t/ha]]","v":17.281489306785705},120,{"$f":"HLOOKUP(A:A,Tool!$C$29:$M$29,1,FALSE)","v":"Žieminiai rapsiukai"},1.65,1.65,17.281489306785705]
["Žieminiai rugiai",15,{"$f":"Table3[[#This Row],[PAN typical, kg/ha]]/Table3[[#This Row],[Biomass typical, t/ha]]*Table3[[#This Row],[User biomass, t/ha]]","v":8.7758761341250455},120,{"$f":"HLOOKUP(A:A,Tool!$C$29:$M$29,1,FALSE)","v":"Žieminiai rugiai"},1.25,1.25,8.7758761341250455]
["Baltieji dobilai",14.0625,{"$f":"Table3[[#This Row],[PAN typical, kg/ha]]/Table3[[#This Row],[Biomass typical, t/ha]]*Table3[[#This Row],[User biomass, t/ha]]","v":{"$error":"#N/A"}},120,{"$f":"HLOOKUP(A:A,Tool!$C$29:$M$29,1,FALSE)","v":{"$error":"#N/A"}},2.0500000000000003,{"$error":"#N/A"},17.78267373907196]
["Raudonieji dobilai",14.0625,{"$f":"Table3[[#This Row],[PAN typical, kg/ha]]/Table3[[#This Row],[Biomass typical, t/ha]]*Table3[[#This Row],[User biomass, t/ha]]","v":{"$error":"#N/A"}},120,{"$f":"HLOOKUP(A:A,Tool!$C$29:$M$29,1,FALSE)","v":{"$error":"#N/A"}},2.0500000000000003,{"$error":"#N/A"},17.78267373907196]
["Baltažiedžiai barkūnai",14.0625,{"$f":"Table3[[#This Row],[PAN typical, kg/ha]]/Table3[[#This Row],[Biomass typical, t/ha]]*Table3[[#This Row],[User biomass, t/ha]]","v":{"$error":"#N/A"}},120,{"$f":"HLOOKUP(A:A,Tool!$C$29:$M$29,1,FALSE)","v":{"$error":"#N/A"}},1.95,{"$error":"#N/A"},16.915226239605033]
["Gausiažiedės svidrės",18,{"$f":"Table3[[#This Row],[PAN typical, kg/ha]]/Table3[[#This Row],[Biomass typical, t/ha]]*Table3[[#This Row],[User biomass, t/ha]]","v":{"$error":"#N/A"}},120,{"$f":"HLOOKUP(A:A,Tool!$C$29:$M$29,1,FALSE)","v":{"$error":"#N/A"}},1.4,{"$error":"#N/A"},5.8291459979216684]
["Daugiametės svidrės",18,{"$f":"Table3[[#This Row],[PAN typical, kg/ha]]/Table3[[#This Row],[Biomass typical, t/ha]]*Table3[[#This Row],[User biomass, t/ha]]","v":{"$error":"#N/A"}},120,{"$f":"HLOOKUP(A:A,Tool!$C$29:$M$29,1,FALSE)","v":{"$error":"#N/A"}},1.4,{"$error":"#N/A"},5.8291459979216684]
["Facelijos",14.0625,{"$f":"Table3[[#This Row],[PAN typical, kg/ha]]/Table3[[#This Row],[Biomass typical, t/ha]]*Table3[[#This Row],[User biomass, t/ha]]","v":{"$error":"#N/A"}},120,{"$f":"HLOOKUP(A:A,Tool!$C$29:$M$29,1,FALSE)","v":{"$error":"#N/A"}},2.0500000000000003,{"$error":"#N/A"},17.78267373907196]
["Paprastosios šunažolės",17.307692307692307,{"$f":"Table3[[#This Row],[PAN typical, kg/ha]]/Table3[[#This Row],[Biomass typical, t/ha]]*Table3[[#This Row],[User biomass, t/ha]]","v":{"$error":"#N/A"}},120,{"$f":"HLOOKUP(A:A,Tool!$C$29:$M$29,1,FALSE)","v":{"$error":"#N/A"}},1.8499999999999999,{"$error":"#N/A"},8.8138254875139843]
["Sėjamosios ir netikšės avižos",17.307692307692307,{"$f":"Table3[[#This Row],[PAN typical, kg/ha]]/Table3[[#This Row],[Biomass typical, t/ha]]*Table3[[#This Row],[User biomass, t/ha]]","v":{"$error":"#N/A"}},120,{"$f":"HLOOKUP(A:A,Tool!$C$29:$M$29,1,FALSE)","v":{"$error":"#N/A"}},1.8499999999999999,{"$error":"#N/A"},8.8138254875139843]
["Grikiai",18.75,{"$f":"Table3[[#This Row],[PAN typical, kg/ha]]/Table3[[#This Row],[Biomass typical, t/ha]]*Table3[[#This Row],[User biomass, t/ha]]","v":{"$error":"#N/A"}},120,{"$f":"HLOOKUP(A:A,Tool!$C$29:$M$29,1,FALSE)","v":{"$error":"#N/A"}},1.8499999999999999,{"$error":"#N/A"},6.5712349952347999]
["Žieminiai (ruginiai) vikiai",10,{"$f":"Table3[[#This Row],[PAN typical, kg/ha]]/Table3[[#This Row],[Biomass typical, t/ha]]*Table3[[#This Row],[User biomass, t/ha]]","v":{"$error":"#N/A"}},120,{"$f":"HLOOKUP(A:A,Tool!$C$29:$M$29,1,FALSE)","v":{"$error":"#N/A"}},1.65,{"$error":"#N/A"},33.876130694018883]
["Sėjamieji žirniai",11.25,{"$f":"Table3[[#This Row],[PAN typical, kg/ha]]/Table3[[#This Row],[Biomass typical, t/ha]]*Table3[[#This Row],[User biomass, t/ha]]","v":{"$error":"#N/A"}},120,{"$f":"HLOOKUP(A:A,Tool!$C$29:$M$29,1,FALSE)","v":{"$error":"#N/A"}},1.8499999999999999,{"$error":"#N/A"},29.468117326819186]
["Siauralapiai lubinai",11.25,{"$f":"Table3[[#This Row],[PAN typical, kg/ha]]/Table3[[#This Row],[Biomass typical, t/ha]]*Table3[[#This Row],[User biomass, t/ha]]","v":{"$error":"#N/A"}},120,{"$f":"HLOOKUP(A:A,Tool!$C$29:$M$29,1,FALSE)","v":{"$error":"#N/A"}},2.0500000000000003,{"$error":"#N/A"},32.653859740529377]
["Pupos",10,{"$f":"Table3[[#This Row],[PAN typical, kg/ha]]/Table3[[#This Row],[Biomass typical, t/ha]]*Table3[[#This Row],[User biomass, t/ha]]","v":{"$error":"#N/A"}},120,{"$f":"HLOOKUP(A:A,Tool!$C$29:$M$29,1,FALSE)","v":{"$error":"#N/A"}},1.95,{"$error":"#N/A"},40.035427183840504]
["Baltosios garstyčios",11.842105263157896,{"$f":"Table3[[#This Row],[PAN typical, kg/ha]]/Table3[[#This Row],[Biomass typical, t/ha]]*Table3[[#This Row],[User biomass, t/ha]]","v":34.665639845918697},140,{"$f":"HLOOKUP(A:A,Tool!$C$29:$M$29,1,FALSE)","v":"Baltosios garstyčios"},2.3000000000000003,2.3000000000000003,34.665639845918697]
["Rudosios garstyčios",11.842105263157896,{"$f":"Table3[[#This Row],[PAN typical, kg/ha]]/Table3[[#This Row],[Biomass typical, t/ha]]*Table3[[#This Row],[User biomass, t/ha]]","v":{"$error":"#N/A"}},140,{"$f":"HLOOKUP(A:A,Tool!$C$29:$M$29,1,FALSE)","v":{"$error":"#N/A"}},2.3000000000000003,{"$error":"#N/A"},34.66563984591874]
["Vasariniai rapsai",12.5,{"$f":"Table3[[#This Row],[PAN typical, kg/ha]]/Table3[[#This Row],[Biomass typical, t/ha]]*Table3[[#This Row],[User biomass, t/ha]]","v":20.570814758608591},140,{"$f":"HLOOKUP(A:A,Tool!$C$29:$M$29,1,FALSE)","v":"Vasariniai rapsai"},1.55,1.55,20.570814758608591]
["Žieminiai rapsai",12.5,{"$f":"Table3[[#This Row],[PAN typical, kg/ha]]/Table3[[#This Row],[Biomass typical, t/ha]]*Table3[[#This Row],[User biomass, t/ha]]","v":20.570814758608591},140,{"$f":"HLOOKUP(A:A,Tool!$C$29:$M$29,1,FALSE)","v":"Žieminiai rapsai"},1.55,{"$f":"VLOOKUP(A:A,K:L,2,FALSE)","v":1.55},20.570814758608591]
["Aliejiniai ridikai",12.162162162162161,{"$f":"Table3[[#This Row],[PAN typical, kg/ha]]/Table3[[#This Row],[Biomass typical, t/ha]]*Table3[[#This Row],[User biomass, t/ha]]","v":41.802985573313677},140,{"$f":"HLOOKUP(A:A,Tool!$C$29:$M$29,1,FALSE)","v":"Aliejiniai ridikai"},2.95,2.95,41.802985573313677]
["Šakniniai ridikai",13.23529411764706,{"$f":"Table3[[#This Row],[PAN typical, kg/ha]]/Table3[[#This Row],[Biomass typical, t/ha]]*Table3[[#This Row],[User biomass, t/ha]]","v":{"$error":"#N/A"}},140,{"$f":"HLOOKUP(A:A,Tool!$C$29:$M$29,1,FALSE)","v":{"$error":"#N/A"}},2.0500000000000003,{"$error":"#N/A"},23.536817231293483]
["Žieminiai rapsiukai",13.23529411764706,{"$f":"Table3[[#This Row],[PAN typical, kg/ha]]/Table3[[#This Row],[Biomass typical, t/ha]]*Table3[[#This Row],[User biomass, t/ha]]","v":18.944267527626454},140,{"$f":"HLOOKUP(A:A,Tool!$C$29:$M$29,1,FALSE)","v":"Žieminiai rapsiukai"},1.65,1.65,18.944267527626454]
["Žieminiai rugiai",15,{"$f":"Table3[[#This Row],[PAN typical, kg/ha]]/Table3[[#This Row],[Biomass typical, t/ha]]*Table3[[#This Row],[User biomass, t/ha]]","v":10.054822696372511},140,{"$f":"HLOOKUP(A:A,Tool!$C$29:$M$29,1,FALSE)","v":"Žieminiai rugiai"},1.25,1.25,10.054822696372511]
["Baltieji dobilai",14.0625,{"$f":"Table3[[#This Row],[PAN typical, kg/ha]]/Table3[[#This Row],[Biomass typical, t/ha]]*Table3[[#This Row],[User biomass, t/ha]]","v":{"$error":"#N/A"}},140,{"$f":"HLOOKUP(A:A,Tool!$C$29:$M$29,1,FALSE)","v":{"$error":"#N/A"}},2.0500000000000003,{"$error":"#N/A"},19.890110827321582]
["Raudonieji dobilai",14.0625,{"$f":"Table3[[#This Row],[PAN typical, kg/ha]]/Table3[[#This Row],[Biomass typical, t/ha]]*Table3[[#This Row],[User biomass, t/ha]]","v":{"$error":"#N/A"}},140,{"$f":"HLOOKUP(A:A,Tool!$C$29:$M$29,1,FALSE)","v":{"$error":"#N/A"}},2.0500000000000003,{"$error":"#N/A"},19.890110827321582]
["Baltažiedžiai barkūnai",14.0625,{"$f":"Table3[[#This Row],[PAN typical, kg/ha]]/Table3[[#This Row],[Biomass typical, t/ha]]*Table3[[#This Row],[User biomass, t/ha]]","v":{"$error":"#N/A"}},140,{"$f":"HLOOKUP(A:A,Tool!$C$29:$M$29,1,FALSE)","v":{"$error":"#N/A"}},1.95,{"$error":"#N/A"},18.919861518671745]
["Gausiažiedės svidrės",18,{"$f":"Table3[[#This Row],[PAN typical, kg/ha]]/Table3[[#This Row],[Biomass typical, t/ha]]*Table3[[#This Row],[User biomass, t/ha]]","v":{"$error":"#N/A"}},140,{"$f":"HLOOKUP(A:A,Tool!$C$29:$M$29,1,FALSE)","v":{"$error":"#N/A"}},1.4,{"$error":"#N/A"},6.9172333094209195]
["Daugiametės svidrės",18,{"$f":"Table3[[#This Row],[PAN typical, kg/ha]]/Table3[[#This Row],[Biomass typical, t/ha]]*Table3[[#This Row],[User biomass, t/ha]]","v":{"$error":"#N/A"}},140,{"$f":"HLOOKUP(A:A,Tool!$C$29:$M$29,1,FALSE)","v":{"$error":"#N/A"}},1.4,{"$error":"#N/A"},6.9172333094209195]
["Facelijos",14.0625,{"$f":"Table3[[#This Row],[PAN typical, kg/ha]]/Table3[[#This Row],[Biomass typical, t/ha]]*Table3[[#This Row],[User biomass, t/ha]]","v":{"$error":"#N/A"}},140,{"$f":"HLOOKUP(A:A,Tool!$C$29:$M$29,1,FALSE)","v":{"$error":"#N/A"}},2.0500000000000003,{"$error":"#N/A"},19.890110827321582]
["Paprastosios šunažolės",17.307692307692307,{"$f":"Table3[[#This Row],[PAN typical, kg/ha]]/Table3[[#This Row],[Biomass typical, t/ha]]*Table3[[#This Row],[User biomass, t/ha]]","v":{"$error":"#N/A"}},140,{"$f":"HLOOKUP(A:A,Tool!$C$29:$M$29,1,FALSE)","v":{"$error":"#N/A"}},1.8499999999999999,{"$error":"#N/A"},10.328166409928594]
["Sėjamosios ir netikšės avižos",17.307692307692307,{"$f":"Table3[[#This Row],[PAN typical, kg/ha]]/Table3[[#This Row],[Biomass typical, t/ha]]*Table3[[#This Row],[User biomass, t/ha]]","v":{"$error":"#N/A"}},140,{"$f":"HLOOKUP(A:A,Tool!$C$29:$M$29,1,FALSE)","v":{"$error":"#N/A"}},1.8499999999999999,{"$error":"#N/A"},10.328166409928594]
["Grikiai",18.75,{"$f":"Table3[[#This Row],[PAN typical, kg/ha]]/Table3[[#This Row],[Biomass typical, t/ha]]*Table3[[#This Row],[User biomass, t/ha]]","v":{"$error":"#N/A"}},140,{"$f":"HLOOKUP(A:A,Tool!$C$29:$M$29,1,FALSE)","v":{"$error":"#N/A"}},1.8499999999999999,{"$error":"#N/A"},7.9387203936016393]
["Žieminiai (ruginiai) vikiai",10,{"$f":"Table3[[#This Row],[PAN typical, kg/ha]]/Table3[[#This Row],[Biomass typical, t/ha]]*Table3[[#This Row],[User biomass, t/ha]]","v":{"$error":"#N/A"}},140,{"$f":"HLOOKUP(A:A,Tool!$C$29:$M$29,1,FALSE)","v":{"$error":"#N/A"}},1.65,{"$error":"#N/A"},35.385130929803964]
["Sėjamieji žirniai",11.25,{"$f":"Table3[[#This Row],[PAN typical, kg/ha]]/Table3[[#This Row],[Biomass typical, t/ha]]*Table3[[#This Row],[User biomass, t/ha]]","v":{"$error":"#N/A"}},140,{"$f":"HLOOKUP(A:A,Tool!$C$29:$M$29,1,FALSE)","v":{"$error":"#N/A"}},1.8499999999999999,{"$error":"#N/A"},31.232057106908901]
["Siauralapiai lubinai",11.25,{"$f":"Table3[[#This Row],[PAN typical, kg/ha]]/Table3[[#This Row],[Biomass typical, t/ha]]*Table3[[#This Row],[User biomass, t/ha]]","v":{"$error":"#N/A"}},140,{"$f":"HLOOKUP(A:A,Tool!$C$29:$M$29,1,FALSE)","v":{"$error":"#N/A"}},2.0500000000000003,{"$error":"#N/A"},34.608495713061217]
["Pupos",10,{"$f":"Table3[[#This Row],[PAN typical, kg/ha]]/Table3[[#This Row],[Biomass typical, t/ha]]*Table3[[#This Row],[User biomass, t/ha]]","v":{"$error":"#N/A"}},140,{"$f":"HLOOKUP(A:A,Tool!$C$29:$M$29,1,FALSE)","v":{"$error":"#N/A"}},1.95,{"$error":"#N/A"},41.818791098859236]
["Baltosios garstyčios",11.842105263157896,{"$f":"Table3[[#This Row],[PAN typical, kg/ha]]/Table3[[#This Row],[Biomass typical, t/ha]]*Table3[[#This Row],[User biomass, t/ha]]","v":36.459766011367698},160,{"$f":"HLOOKUP(A:A,Tool!$C$29:$M$29,1,FALSE)","v":"Baltosios garstyčios"},2.3000000000000003,2.3000000000000003,36.459766011367698]
["Rudosios garstyčios",11.842105263157896,{"$f":"Table3[[#This Row],[PAN typical, kg/ha]]/Table3[[#This Row],[Biomass typical, t/ha]]*Table3[[#This Row],[User biomass, t/ha]]","v":{"$error":"#N/A"}},160,{"$f":"HLOOKUP(A:A,Tool!$C$29:$M$29,1,FALSE)","v":{"$error":"#N/A"}},2.3000000000000003,{"$error":"#N/A"},36.459766011367734]
["Vasariniai rapsai",12.5,{"$f":"Table3[[#This Row],[PAN typical, kg/ha]]/Table3[[#This Row],[Biomass typical, t/ha]]*Table3[[#This Row],[User biomass, t/ha]]","v":21.802397665420209},160,{"$f":"HLOOKUP(A:A,Tool!$C$29:$M$29,1,FALSE)","v":"Vasariniai rapsai"},1.55,1.55,21.802397665420209]
["Žieminiai rapsai",12.5,{"$f":"Table3[[#This Row],[PAN typical, kg/ha]]/Table3[[#This Row],[Biomass typical, t/ha]]*Table3[[#This Row],[User biomass, t/ha]]","v":21.802397665420209},160,{"$f":"HLOOKUP(A:A,Tool!$C$29:$M$29,1,FALSE)","v":"Žieminiai rapsai"},1.55,1.55,21.802397665420209]
["Aliejiniai ridikai",12.162162162162161,{"$f":"Table3[[#This Row],[PAN typical, kg/ha]]/Table3[[#This Row],[Biomass typical, t/ha]]*Table3[[#This Row],[User biomass, t/ha]]","v":44.125255808964546},160,{"$f":"HLOOKUP(A:A,Tool!$C$29:$M$29,1,FALSE)","v":"Aliejiniai ridikai"},2.95,2.95,44.125255808964546]
["Šakniniai ridikai",13.23529411764706,{"$f":"Table3[[#This Row],[PAN typical, kg/ha]]/Table3[[#This Row],[Biomass typical, t/ha]]*Table3[[#This Row],[User biomass, t/ha]]","v":{"$error":"#N/A"}},160,{"$f":"HLOOKUP(A:A,Tool!$C$29:$M$29,1,FALSE)","v":{"$error":"#N/A"}},2.0500000000000003,{"$error":"#N/A"},25.197186213409996]
["Žieminiai rapsiukai",13.23529411764706,{"$f":"Table3[[#This Row],[PAN typical, kg/ha]]/Table3[[#This Row],[Biomass typical, t/ha]]*Table3[[#This Row],[User biomass, t/ha]]","v":20.280662074208038},160,{"$f":"HLOOKUP(A:A,Tool!$C$29:$M$29,1,FALSE)","v":"Žieminiai rapsiukai"},1.65,1.65,20.280662074208038]
["Žieminiai rugiai",15,{"$f":"Table3[[#This Row],[PAN typical, kg/ha]]/Table3[[#This Row],[Biomass typical, t/ha]]*Table3[[#This Row],[User biomass, t/ha]]","v":11.082730279069693},160,{"$f":"HLOOKUP(A:A,Tool!$C$29:$M$29,1,FALSE)","v":"Žieminiai rugiai"},1.25,1.25,11.082730279069693]
["Baltieji dobilai",14.0625,{"$f":"Table3[[#This Row],[PAN typical, kg/ha]]/Table3[[#This Row],[Biomass typical, t/ha]]*Table3[[#This Row],[User biomass, t/ha]]","v":{"$error":"#N/A"}},160,{"$f":"HLOOKUP(A:A,Tool!$C$29:$M$29,1,FALSE)","v":{"$error":"#N/A"}},2.0500000000000003,{"$error":"#N/A"},21.583884955556751]
["Raudonieji dobilai",14.0625,{"$f":"Table3[[#This Row],[PAN typical, kg/ha]]/Table3[[#This Row],[Biomass typical, t/ha]]*Table3[[#This Row],[User biomass, t/ha]]","v":{"$error":"#N/A"}},160,{"$f":"HLOOKUP(A:A,Tool!$C$29:$M$29,1,FALSE)","v":{"$error":"#N/A"}},2.0500000000000003,{"$error":"#N/A"},21.583884955556751]
["Baltažiedžiai barkūnai",14.0625,{"$f":"Table3[[#This Row],[PAN typical, kg/ha]]/Table3[[#This Row],[Biomass typical, t/ha]]*Table3[[#This Row],[User biomass, t/ha]]","v":{"$error":"#N/A"}},160,{"$f":"HLOOKUP(A:A,Tool!$C$29:$M$29,1,FALSE)","v":{"$error":"#N/A"}},1.95,{"$error":"#N/A"},20.531012518700319]
["Gausiažiedės svidrės",18,{"$f":"Table3[[#This Row],[PAN typical, kg/ha]]/Table3[[#This Row],[Biomass typical, t/ha]]*Table3[[#This Row],[User biomass, t/ha]]","v":{"$error":"#N/A"}},160,{"$f":"HLOOKUP(A:A,Tool!$C$29:$M$29,1,FALSE)","v":{"$error":"#N/A"}},1.4,{"$error":"#N/A"},7.7917517022105907]
["Daugiametės svidrės",18,{"$f":"Table3[[#This Row],[PAN typical, kg/ha]]/Table3[[#This Row],[Biomass typical, t/ha]]*Table3[[#This Row],[User biomass, t/ha]]","v":{"$error":"#N/A"}},160,{"$f":"HLOOKUP(A:A,Tool!$C$29:$M$29,1,FALSE)","v":{"$error":"#N/A"}},1.4,{"$error":"#N/A"},7.7917517022105907]
["Facelijos",14.0625,{"$f":"Table3[[#This Row],[PAN typical, kg/ha]]/Table3[[#This Row],[Biomass typical, t/ha]]*Table3[[#This Row],[User biomass, t/ha]]","v":{"$error":"#N/A"}},160,{"$f":"HLOOKUP(A:A,Tool!$C$29:$M$29,1,FALSE)","v":{"$error":"#N/A"}},2.0500000000000003,{"$error":"#N/A"},21.583884955556751]
["Paprastosios šunažolės",17.307692307692307,{"$f":"Table3[[#This Row],[PAN typical, kg/ha]]/Table3[[#This Row],[Biomass typical, t/ha]]*Table3[[#This Row],[User biomass, t/ha]]","v":{"$error":"#N/A"}},160,{"$f":"HLOOKUP(A:A,Tool!$C$29:$M$29,1,FALSE)","v":{"$error":"#N/A"}},1.8499999999999999,{"$error":"#N/A"},11.545270547835981]
["Sėjamosios ir netikšės avižos",17.307692307692307,{"$f":"Table3[[#This Row],[PAN typical, kg/ha]]/Table3[[#This Row],[Biomass typical, t/ha]]*Table3[[#This Row],[User biomass, t/ha]]","v":{"$error":"#N/A"}},160,{"$f":"HLOOKUP(A:A,Tool!$C$29:$M$29,1,FALSE)","v":{"$error":"#N/A"}},1.8499999999999999,{"$error":"#N/A"},11.545270547835981]
["Grikiai",18.75,{"$f":"Table3[[#This Row],[PAN typical, kg/ha]]/Table3[[#This Row],[Biomass typical, t/ha]]*Table3[[#This Row],[User biomass, t/ha]]","v":{"$error":"#N/A"}},160,{"$f":"HLOOKUP(A:A,Tool!$C$29:$M$29,1,FALSE)","v":{"$error":"#N/A"}},1.8499999999999999,{"$error":"#N/A"},9.0378005621090214]
["Žieminiai (ruginiai) vikiai",10,{"$f":"Table3[[#This Row],[PAN typical, kg/ha]]/Table3[[#This Row],[Biomass typical, t/ha]]*Table3[[#This Row],[User biomass, t/ha]]","v":{"$error":"#N/A"}},160,{"$f":"HLOOKUP(A:A,Tool!$C$29:$M$29,1,FALSE)","v":{"$error":"#N/A"}},1.65,{"$error":"#N/A"},36.59793083340606]
["Sėjamieji žirniai",11.25,{"$f":"Table3[[#This Row],[PAN typical, kg/ha]]/Table3[[#This Row],[Biomass typical, t/ha]]*Table3[[#This Row],[User biomass, t/ha]]","v":{"$error":"#N/A"}},160,{"$f":"HLOOKUP(A:A,Tool!$C$29:$M$29,1,FALSE)","v":{"$error":"#N/A"}},1.8499999999999999,{"$error":"#N/A"},32.6497547513775]
["Siauralapiai lubinai",11.25,{"$f":"Table3[[#This Row],[PAN typical, kg/ha]]/Table3[[#This Row],[Biomass typical, t/ha]]*Table3[[#This Row],[User biomass, t/ha]]","v":{"$error":"#N/A"}},160,{"$f":"HLOOKUP(A:A,Tool!$C$29:$M$29,1,FALSE)","v":{"$error":"#N/A"}},2.0500000000000003,{"$error":"#N/A"},36.179457967742643]
["Pupos",10,{"$f":"Table3[[#This Row],[PAN typical, kg/ha]]/Table3[[#This Row],[Biomass typical, t/ha]]*Table3[[#This Row],[User biomass, t/ha]]","v":{"$error":"#N/A"}},160,{"$f":"HLOOKUP(A:A,Tool!$C$29:$M$29,1,FALSE)","v":{"$error":"#N/A"}},1.95,{"$error":"#N/A"},43.252100075843536]

{"sheet":"Pivot-Pan release","index":14,"n_rows":12,"n_cols":2,"rows_kept":12,"cut":false,"hidden":true,"merged":[]}
["Filter","(Multiple Items)"]
[]
["Average of PAN, kg/ha","Column Labels"]
["Row Labels","Aliejiniai ridikai"]
[20,9.8124972122828584]
[40,18.360345940393188]
[60,25.280099210103415]
[80,30.845324090323313]
[100,35.318438647688176]
[120,38.913551687897112]
[140,41.802985573313677]
[160,44.125255808964546]

{"sheet":"Questions","index":15,"n_rows":13,"n_cols":1,"rows_kept":13,"cut":false,"hidden":true,"merged":[]}
["Klausimai"]
[]
["Aušros ataskaitoje Cock's foot yra nurodomas kaip įsėlinis augalas, tuo tarpu Vaclovas nurodęs, kad tik posėlinis."]
["Ar rodyti vieną sėjos normą, ar atskirai drilled ir broadcasted?"]
["Kaip rodyti įsėlinių augalų sėjos laiką. Toks pat kaip posėliniams tikriausiai netinka?"]
["Ar prie warnings prie miglinių augalų (avižų, svidrės ir šunažolės) reikia rašyti, kad gali konkuruoti dėl N su javais?"]
["Gal prie warningų reikėtų prirašyti, kad bastutinių tarpinių pasėlių pradinį augimą gali riboti azoto trūkumas"]
["Ar reikia kažkokių nurodymų dėl \"termination\"?"]
["Peržiūrėti ir papildyti rekomendacijas dėl sėjos. Gal rašyti, kad augalai geriau sudygsta sėti į skustą dirvą?"]
["žirniai, vikiai, lubinai ir kt.) gerai sudygsta tik tuomet kai yra įterptos 3-4 cm gylyje ir gerai padengtos dirvos sluoksniu, todėl pirma skutamos ražienos, vėliau sėjama eiline sėjamąja. Taip pat šias sėklas galima paskleisti trąšų barstytuvu ir jas įterpti ražienų skutimo metu."]
["verta išberti startinę azoto trąšų normą (N 30 kg/ha)"]
["Įsėliniai: Į žieminius javus sėjama su ražieninėmis sėjamosiomis arba sėjamosiomis su specialiais noragėlių priedais, arba kartu su pasėlių akėčiomis sukomplektuotu sėjos aparatu."]
["Auginant įsėlinius tarpinius pasėlius reikia žinoti, kad būtina parinkti javams su įsėliu tinkamus herbicidus, mažinti javų sėklos normą, naudoti mažesnes azoto trąšų normas. "]